<?xml version="1.0" encoding="UTF-8" standalone="no"?>
<svg
   xmlns:dc="http://purl.org/dc/elements/1.1/"
   xmlns:cc="http://creativecommons.org/ns#"
   xmlns:rdf="http://www.w3.org/1999/02/22-rdf-syntax-ns#"
   xmlns:svg="http://www.w3.org/2000/svg"
   xmlns="http://www.w3.org/2000/svg"
   xmlns:sodipodi="http://sodipodi.sourceforge.net/DTD/sodipodi-0.dtd"
   xmlns:inkscape="http://www.inkscape.org/namespaces/inkscape"
   version="1.1"
   width="657"
   height="449"
   viewBox="-0.5 -0.5 657 449"
   id="svg282"
   sodipodi:docname="obs-emulated-workers.svg"
   inkscape:version="0.92.4 5da689c313, 2019-01-14">
  <metadata
     id="metadata286">
    <rdf:RDF>
      <cc:Work
         rdf:about="">
        <dc:format>image/svg+xml</dc:format>
        <dc:type
           rdf:resource="http://purl.org/dc/dcmitype/StillImage" />
        <dc:title />
      </cc:Work>
    </rdf:RDF>
  </metadata>
  <sodipodi:namedview
     pagecolor="#ffffff"
     bordercolor="#666666"
     borderopacity="1"
     objecttolerance="10"
     gridtolerance="10"
     guidetolerance="10"
     inkscape:pageopacity="0"
     inkscape:pageshadow="2"
     inkscape:window-width="3840"
     inkscape:window-height="2018"
     id="namedview284"
     showgrid="false"
     inkscape:zoom="2.9866166"
     inkscape:cx="262.02546"
     inkscape:cy="192.69396"
     inkscape:window-x="0"
     inkscape:window-y="68"
     inkscape:window-maximized="1"
     inkscape:current-layer="svg282"
     fit-margin-top="0"
     fit-margin-left="0"
     fit-margin-right="0"
     fit-margin-bottom="0" />
  <defs
     id="defs2">
    <marker
       inkscape:isstock="true"
       style="overflow:visible"
       id="marker1809"
       refX="0"
       refY="0"
       orient="auto"
       inkscape:stockid="Arrow2Mend">
      <path
         inkscape:connector-curvature="0"
         transform="scale(-0.6)"
         d="M 8.7185878,4.0337352 -2.2072895,0.01601326 8.7185884,-4.0017078 c -1.7454984,2.3720609 -1.7354408,5.6174519 -6e-7,8.035443 z"
         style="fill:#ffffff;fill-opacity:1;fill-rule:evenodd;stroke:#0061cc;stroke-width:0.625;stroke-linejoin:round;stroke-opacity:1"
         id="path1807" />
    </marker>
    <marker
       inkscape:isstock="true"
       style="overflow:visible"
       id="marker1493"
       refX="0"
       refY="0"
       orient="auto"
       inkscape:stockid="Arrow2Mend">
      <path
         transform="scale(-0.6)"
         d="M 8.7185878,4.0337352 -2.2072895,0.01601326 8.7185884,-4.0017078 c -1.7454984,2.3720609 -1.7354408,5.6174519 -6e-7,8.035443 z"
         style="fill:#ffffff;fill-opacity:1;fill-rule:evenodd;stroke:#0061cc;stroke-width:0.625;stroke-linejoin:round;stroke-opacity:1"
         id="path1491"
         inkscape:connector-curvature="0" />
    </marker>
    <marker
       inkscape:stockid="Arrow2Mend"
       orient="auto"
       refY="0"
       refX="0"
       id="Arrow2Mend"
       style="overflow:visible"
       inkscape:isstock="true"
       inkscape:collect="always">
      <path
         id="path1042"
         style="fill:#ffffff;fill-opacity:1;fill-rule:evenodd;stroke:#0061cc;stroke-width:0.625;stroke-linejoin:round;stroke-opacity:1"
         d="M 8.7185878,4.0337352 -2.2072895,0.01601326 8.7185884,-4.0017078 c -1.7454984,2.3720609 -1.7354408,5.6174519 -6e-7,8.035443 z"
         transform="scale(-0.6)"
         inkscape:connector-curvature="0" />
    </marker>
    <marker
       inkscape:stockid="Arrow2Lend"
       orient="auto"
       refY="0"
       refX="0"
       id="marker1299"
       style="overflow:visible"
       inkscape:isstock="true">
      <path
         id="path1297"
         style="fill:#ffffff;fill-opacity:1;fill-rule:evenodd;stroke:#0061cc;stroke-width:0.625;stroke-linejoin:round;stroke-opacity:1"
         d="M 8.7185878,4.0337352 -2.2072895,0.01601326 8.7185884,-4.0017078 c -1.7454984,2.3720609 -1.7354408,5.6174519 -6e-7,8.035443 z"
         transform="matrix(-1.1,0,0,-1.1,-1.1,0)"
         inkscape:connector-curvature="0" />
    </marker>
    <marker
       inkscape:stockid="Arrow2Lend"
       orient="auto"
       refY="0"
       refX="0"
       id="Arrow2Lend"
       style="overflow:visible"
       inkscape:isstock="true">
      <path
         id="path1036"
         style="fill:#ffffff;fill-opacity:1;fill-rule:evenodd;stroke:#0061cc;stroke-width:0.625;stroke-linejoin:round;stroke-opacity:1"
         d="M 8.7185878,4.0337352 -2.2072895,0.01601326 8.7185884,-4.0017078 c -1.7454984,2.3720609 -1.7354408,5.6174519 -6e-7,8.035443 z"
         transform="matrix(-1.1,0,0,-1.1,-1.1,0)"
         inkscape:connector-curvature="0" />
    </marker>
    <marker
       inkscape:stockid="Arrow2Mend"
       orient="auto"
       refY="0"
       refX="0"
       id="Arrow2Mend-8"
       style="overflow:visible"
       inkscape:isstock="true">
      <path
         inkscape:connector-curvature="0"
         id="path1042-8"
         style="fill:#ffffff;fill-opacity:1;fill-rule:evenodd;stroke:#0061cc;stroke-width:0.625;stroke-linejoin:round;stroke-opacity:1"
         d="M 8.7185878,4.0337352 -2.2072895,0.01601326 8.7185884,-4.0017078 c -1.7454984,2.3720609 -1.7354408,5.6174519 -6e-7,8.035443 z"
         transform="scale(-0.6)" />
    </marker>
  </defs>
  <rect
     style="fill:#ffffff;stroke:#0061cc;stroke-width:6;stroke-miterlimit:4;stroke-dasharray:none;stroke-opacity:1"
     id="rect4"
     pointer-events="none"
     ry="9"
     rx="9"
     height="60"
     width="120"
     y="2.5"
     x="2.5" />
  <text
     style="font-style:normal;font-variant:normal;font-weight:normal;font-stretch:normal;font-size:12px;font-family:sans-serif;-inkscape-font-specification:sans-serif;text-anchor:middle;fill:#242424;fill-opacity:1"
     id="text6"
     font-size="12px"
     y="37"
     x="62">
    <tspan
       sodipodi:role="line"
       id="tspan6"
       x="62"
       y="37">OBS backend</tspan>
  </text>
  <path
     style="opacity:1;vector-effect:none;fill:none;fill-opacity:1;stroke:#0061cc;stroke-width:2.5;stroke-linecap:butt;stroke-linejoin:miter;stroke-miterlimit:4;stroke-dasharray:none;stroke-dashoffset:0;stroke-opacity:1;marker-end:url(#marker1809)"
     inkscape:connector-curvature="0"
     id="path12"
     pointer-events="none"
     stroke-miterlimit="10"
     d="m 122.5,47.5 h 204 v 30.63" />
  <path
     style="opacity:1;vector-effect:none;fill:none;fill-opacity:1;stroke:#0061cc;stroke-width:2.5;stroke-linecap:butt;stroke-linejoin:miter;stroke-miterlimit:4;stroke-dasharray:none;stroke-dashoffset:0;stroke-opacity:1;marker-end:url(#Arrow2Mend)"
     inkscape:connector-curvature="0"
     id="path16"
     pointer-events="none"
     stroke-miterlimit="10"
     d="M 122.5,32.5 H 477.13" />
  <path
     style="opacity:1;vector-effect:none;fill:none;fill-opacity:1;stroke:#0061cc;stroke-width:2.5;stroke-linecap:butt;stroke-linejoin:miter;stroke-miterlimit:4;stroke-dasharray:none;stroke-dashoffset:0;stroke-opacity:1;marker-end:url(#marker1493)"
     inkscape:connector-curvature="0"
     id="path20"
     pointer-events="none"
     stroke-miterlimit="10"
     d="m 46.5,62.5 v 86 h 30.63"
     sodipodi:nodetypes="ccc" />
  <rect
     style="fill:#ffffff;stroke:#37c8ab;stroke-width:6;stroke-miterlimit:4;stroke-dasharray:none"
     id="rect24"
     pointer-events="none"
     ry="8.088994"
     rx="5.7452312"
     height="431"
     width="170"
     y="14.5"
     x="483.5" />
  <text
     style="font-style:normal;font-variant:normal;font-weight:normal;font-stretch:normal;font-size:12px;font-family:sans-serif;-inkscape-font-specification:sans-serif;text-anchor:middle;fill:#242424;fill-opacity:1"
     id="text32"
     font-size="12px"
     y="40"
     x="569">
    <tspan
       sodipodi:role="line"
       id="tspan16"
       x="569"
       y="40">OBS worker (<tspan
   style="fill:#37c8ab;fill-opacity:1"
   id="tspan1805">x86_64</tspan>

)</tspan>
  </text>
  <rect
     style="fill:#ffffff;stroke:#000000"
     id="rect38"
     pointer-events="none"
     ry="22.5"
     rx="22.5"
     height="187"
     width="150"
     y="187.5"
     x="493.5" />
  <text
     style="font-style:normal;font-variant:normal;font-weight:normal;font-stretch:normal;font-size:12px;font-family:sans-serif;-inkscape-font-specification:sans-serif;text-anchor:middle;fill:#242424;fill-opacity:1"
     id="text40"
     font-size="12px"
     y="207"
     x="569">
    <tspan
       sodipodi:role="line"
       id="tspan20"
       x="569"
       y="207">Build chroot</tspan>
    <tspan
       sodipodi:role="line"
       id="tspan84"
       x="569"
       y="222">(armv7hl + QEMU)</tspan>
  </text>
  <text
     style="font-size:12px;font-family:Helvetica;text-anchor:middle;fill:#000000"
     font-size="12px"
     y="211"
     x="569"
     id="text667" />
  <rect
     style="opacity:1;vector-effect:none;fill:#ffffff;fill-opacity:1;stroke:#ff8000;stroke-width:3;stroke-linecap:butt;stroke-linejoin:miter;stroke-miterlimit:4;stroke-dasharray:none;stroke-dashoffset:0;stroke-opacity:1"
     id="rect46"
     pointer-events="none"
     ry="8.3999996"
     rx="8.3999996"
     height="56"
     width="129"
     y="231.5"
     x="504" />
  <text
     style="font-style:normal;font-variant:normal;font-weight:normal;font-stretch:normal;font-size:12px;font-family:sans-serif;-inkscape-font-specification:sans-serif;text-anchor:middle;fill:#242424;fill-opacity:1"
     id="text48"
     font-size="12px"
     y="248"
     x="568">
    <tspan
       sodipodi:role="line"
       id="tspan26"
       x="568"
       y="248">qemu-arm-static</tspan>
  </text>
  <text
     style="font-size:12px;font-family:Helvetica;text-anchor:middle;fill:#797979;fill-opacity:1"
     id="text54"
     font-size="12px"
     y="304"
     x="568">
    <tspan
       sodipodi:role="line"
       id="tspan29"
       x="568"
       y="304">• • •</tspan>
  </text>
  <rect
     style="fill:#ffffff;stroke:#b2b2b2;stroke-opacity:1"
     id="rect60"
     pointer-events="none"
     ry="3.1500001"
     rx="3.1500001"
     height="21"
     width="112"
     y="259.5"
     x="512.5" />
  <text
     style="font-style:normal;font-variant:normal;font-weight:normal;font-stretch:normal;font-size:12px;font-family:sans-serif;-inkscape-font-specification:sans-serif;text-anchor:middle;fill:#242424;fill-opacity:1"
     id="text62"
     font-size="12px"
     y="276"
     x="569">
    <tspan
       sodipodi:role="line"
       id="tspan33"
       x="569"
       y="276">build program</tspan>
  </text>
  <rect
     style="fill:#ffffff;stroke:#37c8ab;stroke-width:3"
     id="rect68"
     pointer-events="none"
     ry="17.25"
     rx="17.25"
     height="115"
     width="150"
     y="49.5"
     x="493.5" />
  <text
     style="font-style:normal;font-variant:normal;font-weight:normal;font-stretch:normal;font-size:12px;font-family:sans-serif;-inkscape-font-specification:sans-serif;text-anchor:middle;fill:#242424;fill-opacity:1"
     id="text70"
     font-size="12px"
     y="72"
     x="569">
    <tspan
       sodipodi:role="line"
       id="tspan37"
       x="569"
       y="72">Build chroot (x86_64)</tspan>
  </text>
  <text
     style="font-size:12px;font-family:Helvetica;text-anchor:middle;fill:#797979;fill-opacity:1"
     id="text76"
     font-size="12px"
     y="125"
     x="568">
    <tspan
       sodipodi:role="line"
       id="tspan40"
       x="568"
       y="125">• • •</tspan>
  </text>
  <rect
     style="fill:#ffffff;stroke:#b2b2b2;stroke-opacity:1"
     id="rect82"
     pointer-events="none"
     ry="3.75"
     rx="3.75"
     height="25"
     width="130"
     y="84.5"
     x="503.5" />
  <text
     style="font-style:normal;font-variant:normal;font-weight:normal;font-stretch:normal;font-size:12px;font-family:sans-serif;-inkscape-font-specification:sans-serif;text-anchor:middle;fill:#242424;fill-opacity:1"
     id="text84"
     font-size="12px"
     y="102"
     x="569">
    <tspan
       sodipodi:role="line"
       id="tspan44"
       x="569"
       y="102">build program</tspan>
  </text>
  <text
     style="font-size:12px;font-family:Helvetica;text-anchor:middle;fill:#797979;fill-opacity:1"
     id="text90"
     font-size="12px"
     y="183"
     x="568">
    <tspan
       sodipodi:role="line"
       id="tspan47"
       x="568"
       y="183">• • •</tspan>
  </text>
  <rect
     style="opacity:1;vector-effect:none;fill:#ffffff;fill-opacity:1;stroke:#ff8000;stroke-width:3;stroke-linecap:butt;stroke-linejoin:miter;stroke-miterlimit:4;stroke-dasharray:none;stroke-dashoffset:0;stroke-opacity:1"
     id="rect96"
     pointer-events="none"
     ry="8.3999996"
     rx="8.3999996"
     height="56"
     width="129"
     y="308"
     x="504" />
  <text
     style="font-style:normal;font-variant:normal;font-weight:normal;font-stretch:normal;font-size:12px;font-family:sans-serif;-inkscape-font-specification:sans-serif;text-anchor:middle;fill:#242424;fill-opacity:1"
     id="text98"
     font-size="12px"
     y="325"
     x="568">
    <tspan
       sodipodi:role="line"
       id="tspan51"
       x="568"
       y="325">qemu-arm-static</tspan>
  </text>
  <rect
     style="fill:#ffffff;stroke:#b2b2b2;stroke-opacity:1"
     id="rect104"
     pointer-events="none"
     ry="3.1500001"
     rx="3.1500001"
     height="21"
     width="112"
     y="336"
     x="512.5" />
  <text
     style="font-style:normal;font-variant:normal;font-weight:normal;font-stretch:normal;font-size:12px;font-family:sans-serif;-inkscape-font-specification:sans-serif;text-anchor:middle;fill:#242424;fill-opacity:1"
     id="text106"
     font-size="12px"
     y="352"
     x="569">
    <tspan
       sodipodi:role="line"
       id="tspan55"
       x="569"
       y="352">build program</tspan>
  </text>
  <rect
     style="fill:#ffffff;stroke:#b2b2b2;stroke-opacity:1"
     id="rect112"
     pointer-events="none"
     ry="3.75"
     rx="3.75"
     height="25"
     width="130"
     y="131"
     x="503.5" />
  <text
     style="font-style:normal;font-variant:normal;font-weight:normal;font-stretch:normal;font-size:12px;font-family:sans-serif;-inkscape-font-specification:sans-serif;text-anchor:middle;fill:#242424;fill-opacity:1"
     id="text114"
     font-size="12px"
     y="149"
     x="569">
    <tspan
       sodipodi:role="line"
       id="tspan59"
       x="569"
       y="149">build program</tspan>
  </text>
  <rect
     style="opacity:1;vector-effect:none;fill:#ffffff;fill-opacity:1;stroke:#a680b8;stroke-width:6;stroke-linecap:butt;stroke-linejoin:miter;stroke-miterlimit:4;stroke-dasharray:none;stroke-dashoffset:0;stroke-opacity:1"
     id="rect120"
     pointer-events="none"
     ry="7.7541666"
     rx="6.7496743"
     height="360"
     width="170"
     y="85.5"
     x="283.5" />
  <text
     style="font-style:normal;font-variant:normal;font-weight:normal;font-stretch:normal;font-size:12px;font-family:sans-serif;-inkscape-font-specification:sans-serif;text-anchor:middle;fill:#242424;fill-opacity:1"
     id="text128"
     font-size="12px"
     y="110"
     x="369">
    <tspan
       sodipodi:role="line"
       id="tspan63"
       x="369"
       y="110">OBS worker (<tspan
   style="fill:#a680b8;fill-opacity:1"
   id="tspan1803">aarch64</tspan>

)</tspan>
  </text>
  <rect
     style="opacity:1;vector-effect:none;fill:#ffffff;fill-opacity:1;stroke:#a680b8;stroke-width:3;stroke-linecap:butt;stroke-linejoin:miter;stroke-miterlimit:4;stroke-dasharray:none;stroke-dashoffset:0;stroke-opacity:1"
     id="rect134"
     pointer-events="none"
     ry="17.25"
     rx="17.25"
     height="115"
     width="150"
     y="119.5"
     x="293.5" />
  <text
     style="font-style:normal;font-variant:normal;font-weight:normal;font-stretch:normal;font-size:12px;font-family:sans-serif;-inkscape-font-specification:sans-serif;text-anchor:middle;fill:#242424;fill-opacity:1"
     id="text136"
     font-size="12px"
     y="142"
     x="369">
    <tspan
       sodipodi:role="line"
       id="tspan67"
       x="369"
       y="142">Build chroot (aarch64)</tspan>
  </text>
  <text
     style="font-size:12px;font-family:Helvetica;text-anchor:middle;fill:#797979;fill-opacity:1"
     id="text142"
     font-size="12px"
     y="195"
     x="368">
    <tspan
       sodipodi:role="line"
       id="tspan70"
       x="368"
       y="195">• • •</tspan>
  </text>
  <rect
     style="fill:#ffffff;stroke:#b2b2b2;stroke-opacity:1"
     id="rect148"
     pointer-events="none"
     ry="3.75"
     rx="3.75"
     height="25"
     width="130"
     y="154.5"
     x="303.5" />
  <text
     style="font-style:normal;font-variant:normal;font-weight:normal;font-stretch:normal;font-size:12px;font-family:sans-serif;-inkscape-font-specification:sans-serif;text-anchor:middle;fill:#242424;fill-opacity:1"
     id="text150"
     font-size="12px"
     y="172"
     x="369">
    <tspan
       sodipodi:role="line"
       id="tspan74"
       x="369"
       y="172">build program</tspan>
  </text>
  <text
     style="font-size:12px;font-family:Helvetica;text-anchor:middle;fill:#797979;fill-opacity:1"
     id="text156"
     font-size="12px"
     y="253"
     x="368">
    <tspan
       sodipodi:role="line"
       id="tspan77"
       x="368"
       y="253">• • •</tspan>
  </text>
  <rect
     style="fill:#ffffff;stroke:#b2b2b2;stroke-opacity:1"
     id="rect162"
     pointer-events="none"
     ry="3.75"
     rx="3.75"
     height="25"
     width="130"
     y="201"
     x="303.5" />
  <text
     style="font-style:normal;font-variant:normal;font-weight:normal;font-stretch:normal;font-size:12px;font-family:sans-serif;-inkscape-font-specification:sans-serif;text-anchor:middle;fill:#242424;fill-opacity:1"
     id="text164"
     font-size="12px"
     y="219"
     x="369">
    <tspan
       sodipodi:role="line"
       id="tspan81"
       x="369"
       y="219">build program</tspan>
  </text>
  <rect
     style="opacity:1;vector-effect:none;fill:#ffffff;fill-opacity:1;stroke:#ff8000;stroke-width:3;stroke-linecap:butt;stroke-linejoin:miter;stroke-miterlimit:4;stroke-dasharray:none;stroke-dashoffset:0;stroke-opacity:1"
     id="rect170"
     pointer-events="none"
     ry="17.25"
     rx="17.25"
     height="115"
     width="150"
     y="257.5"
     x="293.5" />
  <text
     style="font-style:normal;font-variant:normal;font-weight:normal;font-stretch:normal;font-size:12px;font-family:sans-serif;-inkscape-font-specification:sans-serif;text-anchor:middle;fill:#242424;fill-opacity:1"
     id="text172"
     font-size="12px"
     y="280"
     x="369">
    <tspan
       sodipodi:role="line"
       id="tspan85"
       x="369"
       y="280">Build chroot (armv7hl)</tspan>
  </text>
  <text
     style="font-size:12px;font-family:Helvetica;text-anchor:middle;fill:#797979;fill-opacity:1"
     id="text178"
     font-size="12px"
     y="333"
     x="368">
    <tspan
       sodipodi:role="line"
       id="tspan88"
       x="368"
       y="333">• • •</tspan>
  </text>
  <rect
     style="fill:#ffffff;stroke:#b2b2b2;stroke-opacity:1"
     id="rect184"
     pointer-events="none"
     ry="3.75"
     rx="3.75"
     height="25"
     width="130"
     y="292.5"
     x="303.5" />
  <text
     style="font-style:normal;font-variant:normal;font-weight:normal;font-stretch:normal;font-size:12px;font-family:sans-serif;-inkscape-font-specification:sans-serif;text-anchor:middle;fill:#242424;fill-opacity:1"
     id="text186"
     font-size="12px"
     y="310"
     x="369">
    <tspan
       sodipodi:role="line"
       id="tspan92"
       x="369"
       y="310">build program</tspan>
  </text>
  <rect
     style="fill:#ffffff;stroke:#b2b2b2;stroke-opacity:1"
     id="rect192"
     pointer-events="none"
     ry="3.75"
     rx="3.75"
     height="25"
     width="130"
     y="339"
     x="303.5" />
  <text
     style="font-style:normal;font-variant:normal;font-weight:normal;font-stretch:normal;font-size:12px;font-family:sans-serif;-inkscape-font-specification:sans-serif;text-anchor:middle;fill:#242424;fill-opacity:1"
     id="text194"
     font-size="12px"
     y="357"
     x="369">
    <tspan
       sodipodi:role="line"
       id="tspan96"
       x="369"
       y="357">build program</tspan>
  </text>
  <rect
     style="opacity:1;vector-effect:none;fill:#ffffff;fill-opacity:1;stroke:#ff8000;stroke-width:6;stroke-linecap:butt;stroke-linejoin:miter;stroke-miterlimit:4;stroke-dasharray:none;stroke-dashoffset:0;stroke-opacity:1"
     id="rect200"
     pointer-events="none"
     ry="5.0755506"
     rx="6.4148607"
     height="358"
     width="170"
     y="87.5"
     x="83.5" />
  <text
     style="font-style:normal;font-variant:normal;font-weight:normal;font-stretch:normal;font-size:12px;font-family:sans-serif;-inkscape-font-specification:sans-serif;text-anchor:middle;fill:#242424;fill-opacity:1"
     id="text208"
     font-size="12px"
     y="113"
     x="168">
    <tspan
       sodipodi:role="line"
       id="tspan100"
       x="168"
       y="113">OBS worker (<tspan
   style="fill:#ff8000;fill-opacity:1"
   id="tspan1687">armv7hl</tspan>

)</tspan>
  </text>
  <rect
     style="opacity:1;vector-effect:none;fill:#ffffff;fill-opacity:1;stroke:#ff8000;stroke-width:3;stroke-linecap:butt;stroke-linejoin:miter;stroke-miterlimit:4;stroke-dasharray:none;stroke-dashoffset:0;stroke-opacity:1"
     id="rect214"
     pointer-events="none"
     ry="17.25"
     rx="17.25"
     height="115"
     width="150"
     y="122.5"
     x="93.5" />
  <text
     style="font-style:normal;font-variant:normal;font-weight:normal;font-stretch:normal;font-size:12px;font-family:sans-serif;-inkscape-font-specification:sans-serif;text-anchor:middle;fill:#242424;fill-opacity:1"
     id="text216"
     font-size="12px"
     y="145"
     x="169">
    <tspan
       sodipodi:role="line"
       id="tspan104"
       x="169"
       y="145">Build chroot (armv7hl)</tspan>
  </text>
  <text
     style="font-size:12px;font-family:Helvetica;text-anchor:middle;fill:#797979;fill-opacity:1"
     id="text222"
     font-size="12px"
     y="198"
     x="168">
    <tspan
       sodipodi:role="line"
       id="tspan107"
       x="168"
       y="198">• • •</tspan>
  </text>
  <rect
     style="fill:#ffffff;stroke:#b2b2b2;stroke-opacity:1"
     id="rect228"
     pointer-events="none"
     ry="3.75"
     rx="3.75"
     height="25"
     width="130"
     y="157.5"
     x="103.5" />
  <text
     style="font-style:normal;font-variant:normal;font-weight:normal;font-stretch:normal;font-size:12px;font-family:sans-serif;-inkscape-font-specification:sans-serif;text-anchor:middle;fill:#242424;fill-opacity:1"
     id="text230"
     font-size="12px"
     y="175"
     x="169">
    <tspan
       sodipodi:role="line"
       id="tspan111"
       x="169"
       y="175">build program</tspan>
  </text>
  <text
     style="font-size:12px;font-family:Helvetica;text-anchor:middle;fill:#797979;fill-opacity:1"
     id="text236"
     font-size="12px"
     y="256"
     x="168">
    <tspan
       sodipodi:role="line"
       id="tspan114"
       x="168"
       y="256">• • •</tspan>
  </text>
  <rect
     style="fill:#ffffff;stroke:#b2b2b2;stroke-opacity:1"
     id="rect242"
     pointer-events="none"
     ry="3.75"
     rx="3.75"
     height="25"
     width="130"
     y="204"
     x="103.5" />
  <text
     style="font-style:normal;font-variant:normal;font-weight:normal;font-stretch:normal;font-size:12px;font-family:sans-serif;-inkscape-font-specification:sans-serif;text-anchor:middle;fill:#242424;fill-opacity:1"
     id="text244"
     font-size="12px"
     y="222"
     x="169">
    <tspan
       sodipodi:role="line"
       id="tspan118"
       x="169"
       y="222">build program</tspan>
  </text>
  <rect
     style="opacity:1;vector-effect:none;fill:#ffffff;fill-opacity:1;stroke:#ff8000;stroke-width:3;stroke-linecap:butt;stroke-linejoin:miter;stroke-miterlimit:4;stroke-dasharray:none;stroke-dashoffset:0;stroke-opacity:1"
     id="rect250"
     pointer-events="none"
     ry="17.25"
     rx="17.25"
     height="115"
     width="150"
     y="260.5"
     x="93.5" />
  <text
     style="font-style:normal;font-variant:normal;font-weight:normal;font-stretch:normal;font-size:12px;font-family:sans-serif;-inkscape-font-specification:sans-serif;text-anchor:middle;fill:#242424;fill-opacity:1"
     id="text252"
     font-size="12px"
     y="283"
     x="169">
    <tspan
       sodipodi:role="line"
       id="tspan122"
       x="169"
       y="283">Build chroot (armv7hl)</tspan>
  </text>
  <text
     style="font-size:12px;font-family:Helvetica;text-anchor:middle;fill:#797979;fill-opacity:1"
     id="text258"
     font-size="12px"
     y="336"
     x="168">
    <tspan
       sodipodi:role="line"
       id="tspan125"
       x="168"
       y="336">• • •</tspan>
  </text>
  <rect
     style="fill:#ffffff;stroke:#b2b2b2;stroke-opacity:1"
     id="rect264"
     pointer-events="none"
     ry="3.75"
     rx="3.75"
     height="25"
     width="130"
     y="295.5"
     x="103.5" />
  <text
     style="font-style:normal;font-variant:normal;font-weight:normal;font-stretch:normal;font-size:12px;font-family:sans-serif;-inkscape-font-specification:sans-serif;text-anchor:middle;fill:#242424;fill-opacity:1"
     id="text266"
     font-size="12px"
     y="313"
     x="169">
    <tspan
       sodipodi:role="line"
       id="tspan129"
       x="169"
       y="313">build program</tspan>
  </text>
  <rect
     style="fill:#ffffff;stroke:#b2b2b2;stroke-opacity:1"
     id="rect272"
     pointer-events="none"
     ry="3.75"
     rx="3.75"
     height="25"
     width="130"
     y="342"
     x="103.5" />
  <text
     style="font-style:normal;font-variant:normal;font-weight:normal;font-stretch:normal;font-size:12px;font-family:sans-serif;-inkscape-font-specification:sans-serif;text-anchor:middle;fill:#242424;fill-opacity:1"
     id="text274"
     font-size="12px"
     y="360"
     x="169">
    <tspan
       sodipodi:role="line"
       id="tspan133"
       x="169"
       y="360">build program</tspan>
  </text>
  <text
     xml:space="preserve"
     style="font-style:normal;font-weight:normal;font-size:40px;line-height:1.25;font-family:sans-serif;letter-spacing:0px;word-spacing:0px;fill:#000000;fill-opacity:1;stroke:none"
     x="120.19843"
     y="426.57556"
     id="text548"><tspan
       sodipodi:role="line"
       id="tspan546"
       x="120.19843"
       y="461.96619" /></text>
  <text
     xml:space="preserve"
     style="font-style:normal;font-variant:normal;font-weight:normal;font-stretch:normal;font-size:12px;line-height:1.25;font-family:sans-serif;-inkscape-font-specification:sans-serif;text-align:center;letter-spacing:0px;word-spacing:0px;text-anchor:middle;fill:#242424;fill-opacity:1;stroke:none"
     x="168.53223"
     y="407.65784"
     id="text552"><tspan
       sodipodi:role="line"
       id="tspan550"
       x="168.53223"
       y="407.65784"
       style="font-style:normal;font-variant:normal;font-weight:normal;font-stretch:normal;font-size:12px;font-family:sans-serif;-inkscape-font-specification:sans-serif;fill:#242424;fill-opacity:1">ARMv7 32 bit hard-float</tspan><tspan
       sodipodi:role="line"
       x="168.53223"
       y="422.65784"
       id="tspan554"
       style="font-style:normal;font-variant:normal;font-weight:normal;font-stretch:normal;font-size:12px;font-family:sans-serif;-inkscape-font-specification:sans-serif;fill:#242424;fill-opacity:1">host/VM</tspan></text>
  <text
     xml:space="preserve"
     style="font-style:normal;font-variant:normal;font-weight:normal;font-stretch:normal;font-size:12px;line-height:1.25;font-family:sans-serif;-inkscape-font-specification:sans-serif;text-align:center;letter-spacing:0px;word-spacing:0px;text-anchor:middle;fill:#242424;fill-opacity:1;stroke:none"
     x="368.53223"
     y="398.13797"
     id="text552-0"><tspan
       sodipodi:role="line"
       x="368.53223"
       y="398.13797"
       id="tspan554-3"
       style="font-style:normal;font-variant:normal;font-weight:normal;font-stretch:normal;font-size:12px;font-family:sans-serif;-inkscape-font-specification:sans-serif;fill:#242424;fill-opacity:1">ARMv8 64 bit</tspan><tspan
       sodipodi:role="line"
       x="368.53223"
       y="413.13797"
       style="font-style:normal;font-variant:normal;font-weight:normal;font-stretch:normal;font-size:12px;font-family:sans-serif;-inkscape-font-specification:sans-serif;fill:#242424;fill-opacity:1"
       id="tspan653">host/VM, with</tspan><tspan
       sodipodi:role="line"
       x="368.53223"
       y="428.13797"
       style="font-style:normal;font-variant:normal;font-weight:normal;font-stretch:normal;font-size:12px;font-family:sans-serif;-inkscape-font-specification:sans-serif;fill:#242424;fill-opacity:1"
       id="tspan659">ARMv7 32 bit support</tspan></text>
  <text
     xml:space="preserve"
     style="font-style:normal;font-variant:normal;font-weight:normal;font-stretch:normal;font-size:12px;line-height:1.25;font-family:sans-serif;-inkscape-font-specification:sans-serif;text-align:center;letter-spacing:0px;word-spacing:0px;text-anchor:middle;fill:#242424;fill-opacity:1;stroke:none"
     x="568.12207"
     y="407.65784"
     id="text552-6"><tspan
       sodipodi:role="line"
       x="568.12207"
       y="407.65784"
       id="tspan554-6"
       style="font-style:normal;font-variant:normal;font-weight:normal;font-stretch:normal;font-size:12px;font-family:sans-serif;-inkscape-font-specification:sans-serif;fill:#242424;fill-opacity:1">Intel x86-64</tspan><tspan
       sodipodi:role="line"
       x="568.12207"
       y="422.65784"
       style="font-style:normal;font-variant:normal;font-weight:normal;font-stretch:normal;font-size:12px;font-family:sans-serif;-inkscape-font-specification:sans-serif;fill:#242424;fill-opacity:1"
       id="tspan663">host/VM</tspan></text>
</svg>
