<?xml version="1.0" encoding="utf-8"?>
<!-- Generator: Adobe Illustrator 25.0.1, SVG Export Plug-In . SVG Version: 6.00 Build 0)  -->
<svg version="1.1" id="Layer_1" xmlns="http://www.w3.org/2000/svg" xmlns:xlink="http://www.w3.org/1999/xlink" x="0px" y="0px"
	 viewBox="0 0 154.88 31.61" style="enable-background:new 0 0 154.88 31.61;" xml:space="preserve">
<style type="text/css">
	.st0{fill:#FFFFFF;}
</style>
<g id="g12_55_" transform="scale(0.1,0.1)">
	<path id="path14_55_" class="st0" d="M186.64,115.38l39.41,68.27c31.28,5.38,60.46,17.06,86.13,33.68L186.64-0.12L61.09,217.34
		c25.68-16.62,54.85-28.3,86.14-33.68L186.64,115.38"/>
	<path id="path16_55_" class="st0" d="M296.54,233.25c-17.11-10.55-35.84-18.72-55.73-24.04c-17.29-4.62-35.42-7.11-54.16-7.11
		c-18.73,0-36.88,2.49-54.18,7.11c-19.89,5.32-38.62,13.49-55.72,24.04C44.23,253.32,17.59,282.01,0,316.1h68.66
		c27.93-34.29,70.43-56.25,117.98-56.25c47.55,0,90.08,21.96,117.96,56.25h68.66C355.7,282.01,329.04,253.32,296.54,233.25"/>
</g>
<g>
	<path id="path18_5_" class="st0" d="M62.92,7.44h1.69l7.51,16.39h-2.45L67.43,19h-7.15l-2.09,4.83h-2.46L62.92,7.44L62.92,7.44z
		 M66.45,16.93l-2.7-5.91l-2.51,5.91H66.45"/>
	<path id="path20_5_" class="st0" d="M75.54,23.83V8.81h5.32c1.6,0,2.88,0.38,3.84,1.16c0.95,0.77,1.43,1.81,1.43,3.12
		c0,0.87-0.25,1.64-0.73,2.32c-0.49,0.67-1.16,1.16-2.01,1.47c-0.85,0.3-2.07,0.46-3.65,0.46h-1.78v6.51H75.54L75.54,23.83z
		 M80.45,10.72h-2.49v4.69h2.63c0.98,0,1.73-0.21,2.26-0.62c0.53-0.41,0.8-1,0.8-1.77C83.64,11.49,82.58,10.72,80.45,10.72"/>
	<path id="path22_5_" class="st0" d="M89.56,8.85h9.52v1.91h-7.12v4.57h6.88v1.92h-6.88v4.66h7.34v1.91h-9.75V8.85"/>
	<path id="path24_5_" class="st0" d="M104.64,23.83v-15h4.21c1.7,0,3.04,0.38,4.04,1.13c0.99,0.75,1.5,1.77,1.5,3.05
		c0,0.87-0.25,1.63-0.74,2.26c-0.48,0.63-1.19,1.11-2.1,1.43c0.54,0.31,1.06,0.75,1.58,1.29c0.51,0.55,1.23,1.49,2.16,2.85
		c0.59,0.85,1.06,1.49,1.41,1.92l0.89,1.07h-2.86l-0.73-0.99c-0.02-0.04-0.07-0.1-0.14-0.18l-0.47-0.59l-0.75-1.1l-0.8-1.17
		c-0.5-0.62-0.95-1.1-1.37-1.47c-0.41-0.36-0.78-0.63-1.11-0.79c-0.34-0.16-0.9-0.24-1.68-0.24h-0.63v6.53H104.64L104.64,23.83z
		 M107.77,10.66h-0.72v4.74h0.91c1.22,0,2.05-0.09,2.51-0.28c0.46-0.19,0.81-0.47,1.06-0.84c0.25-0.38,0.38-0.81,0.38-1.28
		c0-0.47-0.14-0.9-0.42-1.28c-0.28-0.38-0.68-0.65-1.19-0.81C109.79,10.74,108.94,10.66,107.77,10.66"/>
	<path id="path26_5_" class="st0" d="M118.55,8.81h14.03v1.91h-5.85v13.11h-2.42V10.72h-5.76V8.81"/>
	<path id="path28_5_" class="st0" d="M136.55,23.83h2.4v-15h-2.4V23.83z"/>
	<path id="path30_5_" class="st0" d="M149.14,16.95l-2.37-1.06c-1.48-0.67-2.54-1.32-3.17-1.97c-0.63-0.64-0.95-1.39-0.95-2.23
		c0-1.26,0.6-2.28,1.79-3.07c1.19-0.78,2.74-1.18,4.64-1.18c1.82,0,3.49,0.38,5.01,1.13v2.6c-1.57-1.11-3.26-1.66-5.07-1.66
		c-1.02,0-1.86,0.18-2.51,0.52c-0.65,0.35-0.98,0.79-0.98,1.33c0,0.48,0.24,0.93,0.72,1.34c0.49,0.42,1.26,0.86,2.33,1.32l2.38,1.04
		c2.66,1.16,3.99,2.65,3.99,4.45c0,1.28-0.58,2.32-1.75,3.12c-1.17,0.8-2.69,1.2-4.56,1.2c-2.15,0-4.11-0.48-5.88-1.46v-2.91
		c1.69,1.57,3.63,2.35,5.85,2.35c0.98,0,1.79-0.2,2.44-0.6c0.65-0.4,0.97-0.9,0.97-1.5C152.01,18.74,151.06,17.82,149.14,16.95"/>
</g>
</svg>
