<?xml version="1.0" encoding="UTF-8" standalone="no"?>
<!DOCTYPE svg PUBLIC "-//W3C//DTD SVG 1.0//EN" "http://www.w3.org/TR/2001/PR-SVG-20010719/DTD/svg10.dtd">
<svg width="54cm" height="55cm" viewBox="499 -501 1062 1082" xmlns="http://www.w3.org/2000/svg" xmlns:xlink="http://www.w3.org/1999/xlink">
  <g>
    <rect style="fill: #ffffff" x="500" y="-100" width="460" height="320"/>
    <rect style="fill: none; fill-opacity:0; stroke-width: 2; stroke: #000000" x="500" y="-100" width="460" height="320"/>
  </g>
  <g>
    <rect style="fill: #ffffff" x="500" y="260" width="460" height="320"/>
    <rect style="fill: none; fill-opacity:0; stroke-width: 2; stroke: #000000" x="500" y="260" width="460" height="320"/>
  </g>
  <g>
    <rect style="fill: #ffffff" x="500" y="-460" width="460" height="320"/>
    <rect style="fill: none; fill-opacity:0; stroke-width: 2; stroke: #000000" x="500" y="-460" width="460" height="320"/>
  </g>
  <text font-size="22.5778" style="fill: #000000;text-anchor:middle;font-family:sans-serif;font-style:normal;font-weight:normal" x="730" y="-480">
    <tspan x="730" y="-480">Composited overlays</tspan>
  </text>
  <g>
    <g>
      <rect style="fill: #ffc0cb" x="640" y="-440" width="300" height="220"/>
      <rect style="fill: none; fill-opacity:0; stroke-width: 2; stroke: #000000" x="640" y="-440" width="300" height="220"/>
    </g>
    <line style="fill: none; fill-opacity:0; stroke-width: 2; stroke: #000000" x1="640" y1="-420" x2="940" y2="-420"/>
    <line style="fill: none; fill-opacity:0; stroke-width: 2; stroke: #000000" x1="920" y1="-420" x2="920" y2="-440"/>
    <line style="fill: none; fill-opacity:0; stroke-width: 2; stroke: #000000" x1="900" y1="-420" x2="900" y2="-440"/>
    <line style="fill: none; fill-opacity:0; stroke-width: 2; stroke: #000000" x1="880" y1="-420" x2="880" y2="-440"/>
  </g>
  <g>
    <g>
      <rect style="fill: #e6e6fa" x="600" y="-400" width="300" height="220"/>
      <rect style="fill: none; fill-opacity:0; stroke-width: 2; stroke: #000000" x="600" y="-400" width="300" height="220"/>
    </g>
    <line style="fill: none; fill-opacity:0; stroke-width: 2; stroke: #000000" x1="600" y1="-380" x2="900" y2="-380"/>
    <line style="fill: none; fill-opacity:0; stroke-width: 2; stroke: #000000" x1="880" y1="-380" x2="880" y2="-400"/>
    <line style="fill: none; fill-opacity:0; stroke-width: 2; stroke: #000000" x1="860" y1="-380" x2="860" y2="-400"/>
    <line style="fill: none; fill-opacity:0; stroke-width: 2; stroke: #000000" x1="840" y1="-380" x2="840" y2="-400"/>
  </g>
  <text font-size="56.4444" style="fill: #000000;text-anchor:middle;font-family:sans-serif;font-style:normal;font-weight:normal" x="750" y="-270.45">
    <tspan x="750" y="-270.45">2</tspan>
  </text>
  <g>
    <g>
      <rect style="fill: #ffff84" x="520" y="-70" width="300" height="220"/>
      <rect style="fill: none; fill-opacity:0; stroke-width: 2; stroke: #000000" x="520" y="-70" width="300" height="220"/>
    </g>
    <line style="fill: none; fill-opacity:0; stroke-width: 2; stroke: #000000" x1="520" y1="-50" x2="820" y2="-50"/>
    <line style="fill: none; fill-opacity:0; stroke-width: 2; stroke: #000000" x1="800" y1="-50" x2="800" y2="-70"/>
    <line style="fill: none; fill-opacity:0; stroke-width: 2; stroke: #000000" x1="780" y1="-50" x2="780" y2="-70"/>
    <line style="fill: none; fill-opacity:0; stroke-width: 2; stroke: #000000" x1="760" y1="-50" x2="760" y2="-70"/>
  </g>
  <text font-size="56.4444" style="fill: #000000;text-anchor:middle;font-family:sans-serif;font-style:normal;font-weight:normal" x="670" y="59.55">
    <tspan x="670" y="59.55">1</tspan>
  </text>
  <g>
    <rect style="fill: #e17de5" x="700" y="350" width="100" height="100"/>
    <rect style="fill: none; fill-opacity:0; stroke-width: 2; stroke: #000000" x="700" y="350" width="100" height="100"/>
  </g>
  <text font-size="12.8" style="fill: #000000;text-anchor:middle;font-family:sans-serif;font-style:normal;font-weight:normal" x="750" y="404.45">
    <tspan x="750" y="404.45">Video</tspan>
  </text>
  <g>
    <rect style="fill: #ffffff" x="1100" y="-100" width="460" height="320"/>
    <rect style="fill: none; fill-opacity:0; stroke-width: 2; stroke: #000000" x="1100" y="-100" width="460" height="320"/>
  </g>
  <text font-size="56.4444" style="fill: #000000;text-anchor:middle;font-family:sans-serif;font-style:normal;font-weight:normal" x="1270" y="59.55">
    <tspan x="1270" y="59.55">1</tspan>
  </text>
  <g>
    <g>
      <rect style="fill: #ffc0cb" x="1240" y="-80" width="300" height="220"/>
      <rect style="fill: none; fill-opacity:0; stroke-width: 2; stroke: #000000" x="1240" y="-80" width="300" height="220"/>
    </g>
    <line style="fill: none; fill-opacity:0; stroke-width: 2; stroke: #000000" x1="1240" y1="-60" x2="1540" y2="-60"/>
    <line style="fill: none; fill-opacity:0; stroke-width: 2; stroke: #000000" x1="1520" y1="-60" x2="1520" y2="-80"/>
    <line style="fill: none; fill-opacity:0; stroke-width: 2; stroke: #000000" x1="1500" y1="-60" x2="1500" y2="-80"/>
    <line style="fill: none; fill-opacity:0; stroke-width: 2; stroke: #000000" x1="1480" y1="-60" x2="1480" y2="-80"/>
  </g>
  <g>
    <g>
      <rect style="fill: #e6e6fa" x="1200" y="-40" width="300" height="220"/>
      <rect style="fill: none; fill-opacity:0; stroke-width: 2; stroke: #000000" x="1200" y="-40" width="300" height="220"/>
    </g>
    <line style="fill: none; fill-opacity:0; stroke-width: 2; stroke: #000000" x1="1200" y1="-20" x2="1500" y2="-20"/>
    <line style="fill: none; fill-opacity:0; stroke-width: 2; stroke: #000000" x1="1480" y1="-20" x2="1480" y2="-40"/>
    <line style="fill: none; fill-opacity:0; stroke-width: 2; stroke: #000000" x1="1460" y1="-20" x2="1460" y2="-40"/>
    <line style="fill: none; fill-opacity:0; stroke-width: 2; stroke: #000000" x1="1440" y1="-20" x2="1440" y2="-40"/>
  </g>
  <text font-size="56.4444" style="fill: #000000;text-anchor:middle;font-family:sans-serif;font-style:normal;font-weight:normal" x="1350" y="89.55">
    <tspan x="1350" y="89.55">2</tspan>
  </text>
  <g>
    <g>
      <rect style="fill: #ffff84" x="1120" y="-70" width="300" height="220"/>
      <rect style="fill: none; fill-opacity:0; stroke-width: 2; stroke: #000000" x="1120" y="-70" width="300" height="220"/>
    </g>
    <line style="fill: none; fill-opacity:0; stroke-width: 2; stroke: #000000" x1="1120" y1="-50" x2="1420" y2="-50"/>
    <line style="fill: none; fill-opacity:0; stroke-width: 2; stroke: #000000" x1="1400" y1="-50" x2="1400" y2="-70"/>
    <line style="fill: none; fill-opacity:0; stroke-width: 2; stroke: #000000" x1="1380" y1="-50" x2="1380" y2="-70"/>
    <line style="fill: none; fill-opacity:0; stroke-width: 2; stroke: #000000" x1="1360" y1="-50" x2="1360" y2="-70"/>
  </g>
  <text font-size="56.4444" style="fill: #000000;text-anchor:middle;font-family:sans-serif;font-style:normal;font-weight:normal" x="1270" y="59.55">
    <tspan x="1270" y="59.55">1</tspan>
  </text>
  <g>
    <rect style="fill: #e17de5" x="1300" y="-10" width="100" height="100"/>
    <rect style="fill: none; fill-opacity:0; stroke-width: 2; stroke: #000000" x="1300" y="-10" width="100" height="100"/>
  </g>
  <text font-size="12.8" style="fill: #000000;text-anchor:middle;font-family:sans-serif;font-style:normal;font-weight:normal" x="1350" y="44.45">
    <tspan x="1350" y="44.45">Video</tspan>
  </text>
  <text font-size="22.5778" style="fill: #000000;text-anchor:middle;font-family:sans-serif;font-style:normal;font-weight:normal" x="1330" y="-120">
    <tspan x="1330" y="-120">Final screen output</tspan>
  </text>
  <g>
    <line style="fill: none; fill-opacity:0; stroke-width: 2; stroke: #000000" x1="960" y1="60" x2="1090.26" y2="60"/>
    <polygon style="fill: #000000" points="1097.76,60 1087.76,65 1090.26,60 1087.76,55 "/>
    <polygon style="fill: none; fill-opacity:0; stroke-width: 2; stroke: #000000" points="1097.76,60 1087.76,65 1090.26,60 1087.76,55 "/>
  </g>
  <text font-size="12.8" style="fill: #000000;text-anchor:middle;font-family:sans-serif;font-style:normal;font-weight:normal" x="1030" y="21">
    <tspan x="1030" y="21">Composited in</tspan>
    <tspan x="1030" y="37">display controller</tspan>
  </text>
  <g>
    <path style="fill: none; fill-opacity:0; stroke-width: 2; stroke: #000000" d="M 960 -300 C 1060,-300 1000,-40 1090.26,-40"/>
    <polygon style="fill: #000000" points="1097.76,-40 1087.76,-35 1090.26,-40 1087.76,-45 "/>
    <polygon style="fill: none; fill-opacity:0; stroke-width: 2; stroke: #000000" points="1097.76,-40 1087.76,-35 1090.26,-40 1087.76,-45 "/>
  </g>
  <g>
    <path style="fill: none; fill-opacity:0; stroke-width: 2; stroke: #000000" d="M 960 420 C 1060,420 1000,160 1090.26,160"/>
    <polygon style="fill: #000000" points="1097.76,160 1087.76,165 1090.26,160 1087.76,155 "/>
    <polygon style="fill: none; fill-opacity:0; stroke-width: 2; stroke: #000000" points="1097.76,160 1087.76,165 1090.26,160 1087.76,155 "/>
  </g>
</svg>
