<?xml version="1.0" encoding="UTF-8" standalone="no"?>
<!DOCTYPE svg PUBLIC "-//W3C//DTD SVG 1.0//EN" "http://www.w3.org/TR/2001/PR-SVG-20010719/DTD/svg10.dtd">
<svg width="43cm" height="14cm" viewBox="298 118 843 263" xmlns="http://www.w3.org/2000/svg" xmlns:xlink="http://www.w3.org/1999/xlink">
  <g>
    <rect style="fill: #add8e6" x="540" y="120" width="380" height="100"/>
    <rect style="fill: none; fill-opacity:0; stroke-width: 2; stroke: #000000" x="540" y="120" width="380" height="100"/>
  </g>
  <g>
    <rect style="fill: #f9cc6d" x="540" y="280" width="160" height="100"/>
    <rect style="fill: none; fill-opacity:0; stroke-width: 2; stroke: #000000" x="540" y="280" width="160" height="100"/>
  </g>
  <g>
    <rect style="fill: #bfbfbf" x="760" y="280" width="160" height="100"/>
    <rect style="fill: none; fill-opacity:0; stroke-width: 2; stroke: #000000" x="760" y="280" width="160" height="100"/>
  </g>
  <g>
    <rect style="fill: #bfbfbf" x="980" y="280" width="160" height="100"/>
    <rect style="fill: none; fill-opacity:0; stroke-width: 2; stroke: #000000" x="980" y="280" width="160" height="100"/>
  </g>
  <g>
    <line style="fill: none; fill-opacity:0; stroke-width: 2; stroke: #bfbfbf" x1="620" y1="224.472" x2="620" y2="275.528"/>
    <polyline style="fill: none; fill-opacity:0; stroke-width: 2; stroke: #bfbfbf" points="625,232.236 620,222.236 615,232.236 "/>
    <polyline style="fill: none; fill-opacity:0; stroke-width: 2; stroke: #bfbfbf" points="615,267.764 620,277.764 625,267.764 "/>
  </g>
  <g>
    <line style="fill: none; fill-opacity:0; stroke-width: 2; stroke: #bfbfbf" x1="840" y1="224.472" x2="840" y2="275.528"/>
    <polyline style="fill: none; fill-opacity:0; stroke-width: 2; stroke: #bfbfbf" points="845,232.236 840,222.236 835,232.236 "/>
    <polyline style="fill: none; fill-opacity:0; stroke-width: 2; stroke: #bfbfbf" points="835,267.764 840,277.764 845,267.764 "/>
  </g>
  <g>
    <line style="fill: none; fill-opacity:0; stroke-width: 2; stroke: #bfbfbf" x1="700" y1="330" x2="755.528" y2="330"/>
    <polyline style="fill: none; fill-opacity:0; stroke-width: 2; stroke: #bfbfbf" points="747.764,335 757.764,330 747.764,325 "/>
  </g>
  <g>
    <line style="fill: none; fill-opacity:0; stroke-width: 2; stroke: #bfbfbf" x1="920" y1="330" x2="975.528" y2="330"/>
    <polyline style="fill: none; fill-opacity:0; stroke-width: 2; stroke: #bfbfbf" points="967.764,335 977.764,330 967.764,325 "/>
  </g>
  <text font-size="12.8" style="fill: #000000;text-anchor:middle;font-family:sans-serif;font-style:normal;font-weight:normal" x="1060" y="334.45">
    <tspan x="1060" y="334.45">Screen</tspan>
  </text>
  <text font-size="12.8" style="fill: #000000;text-anchor:middle;font-family:sans-serif;font-style:normal;font-weight:normal" x="840" y="334.45">
    <tspan x="840" y="334.45">Display controller</tspan>
  </text>
  <text font-size="12.8" style="fill: #000000;text-anchor:middle;font-family:sans-serif;font-style:normal;font-weight:normal" x="620" y="334.45">
    <tspan x="620" y="334.45">GPU</tspan>
  </text>
  <text font-size="12.8" style="fill: #000000;text-anchor:middle;font-family:sans-serif;font-style:normal;font-weight:normal" x="730" y="174.45">
    <tspan x="730" y="174.45">Graphics memory</tspan>
  </text>
  <g>
    <path style="fill: none; fill-opacity:0; stroke-width: 2; stroke: #000000" d="M 540 330 C 503.48,330 390,330 384.354,318.708"/>
    <polygon style="fill: #000000" points="381,312 389.944,318.708 384.354,318.708 381,323.18 "/>
    <polygon style="fill: none; fill-opacity:0; stroke-width: 2; stroke: #000000" points="381,312 389.944,318.708 384.354,318.708 381,323.18 "/>
  </g>
  <g>
    <rect style="fill: #a52a2a" x="300" y="210" width="160" height="100"/>
    <rect style="fill: none; fill-opacity:0; stroke-width: 2; stroke: #000000" x="300" y="210" width="160" height="100"/>
  </g>
  <text font-size="12.8" style="fill: #ffffff;text-anchor:middle;font-family:sans-serif;font-style:normal;font-weight:normal" x="380" y="264.45">
    <tspan x="380" y="264.45">Weston</tspan>
  </text>
  <text font-size="12.8" style="fill: #000000;text-anchor:end;font-family:sans-serif;font-style:normal;font-weight:normal" x="520" y="351.9">
    <tspan x="520" y="351.9">GPU resource handle</tspan>
  </text>
</svg>
