<?xml version="1.0" encoding="UTF-8" standalone="no"?>
<!-- Generated by graphviz version 2.40.1 (20161225.0304)
 -->

<!-- Title: overview Pages: 1 -->

<svg
   xmlns:dc="http://purl.org/dc/elements/1.1/"
   xmlns:cc="http://creativecommons.org/ns#"
   xmlns:rdf="http://www.w3.org/1999/02/22-rdf-syntax-ns#"
   xmlns:svg="http://www.w3.org/2000/svg"
   xmlns="http://www.w3.org/2000/svg"
   xmlns:sodipodi="http://sodipodi.sourceforge.net/DTD/sodipodi-0.dtd"
   xmlns:inkscape="http://www.inkscape.org/namespaces/inkscape"
   width="877.58264"
   height="805.02216"
   viewBox="0 0 658.18699 603.76661"
   version="1.1"
   id="svg140"
   sodipodi:docname="apertis-application-framework-overview.svg"
   inkscape:version="0.92.4 5da689c313, 2019-01-14">
  <metadata
     id="metadata146">
    <rdf:RDF>
      <cc:Work
         rdf:about="">
        <dc:format>image/svg+xml</dc:format>
        <dc:type
           rdf:resource="http://purl.org/dc/dcmitype/StillImage" />
        <dc:title></dc:title>
      </cc:Work>
    </rdf:RDF>
  </metadata>
  <defs
     id="defs144" />
  <sodipodi:namedview
     pagecolor="#ffffff"
     bordercolor="#666666"
     borderopacity="1"
     objecttolerance="10"
     gridtolerance="10"
     guidetolerance="10"
     inkscape:pageopacity="0"
     inkscape:pageshadow="2"
     inkscape:window-width="3840"
     inkscape:window-height="2018"
     id="namedview142"
     showgrid="false"
     inkscape:object-paths="true"
     inkscape:snap-intersection-paths="true"
     inkscape:snap-others="true"
     inkscape:snap-grids="true"
     inkscape:snap-midpoints="true"
     inkscape:snap-bbox="true"
     units="px"
     fit-margin-top="10"
     fit-margin-right="10"
     fit-margin-bottom="10"
     fit-margin-left="10"
     inkscape:zoom="1.1760797"
     inkscape:cx="427.11528"
     inkscape:cy="309.83632"
     inkscape:window-x="0"
     inkscape:window-y="68"
     inkscape:window-maximized="1"
     inkscape:current-layer="svg140" />
  <rect
     style="opacity:1;vector-effect:none;fill:#ffffff;fill-opacity:1;stroke:#2dbc20;stroke-width:2.69003129;stroke-linecap:butt;stroke-linejoin:miter;stroke-miterlimit:4;stroke-dasharray:none;stroke-dashoffset:0;stroke-opacity:1"
     id="rect152-3-1-3-5"
     width="200.82144"
     height="81.394562"
     x="80.543037"
     y="401.62167"
     rx="13.71916"
     ry="0.18013902" />
  <text
     xml:space="preserve"
     style="font-style:normal;font-weight:normal;font-size:7.17341709px;line-height:1.25;font-family:sans-serif;letter-spacing:0px;word-spacing:0px;fill:#000000;fill-opacity:1;stroke:none;stroke-width:0.53800625"
     x="80.118462"
     y="394.30746"
     id="text216-9-2-2-6"><tspan
       sodipodi:role="line"
       x="80.118462"
       y="394.30746"
       style="font-size:12.91215038px;stroke-width:0.53800625"
       id="tspan291-8-6-9">systemd sandbox</tspan></text>
  <rect
     style="opacity:1;vector-effect:none;fill:#ffffff;fill-opacity:1;stroke:#008fff;stroke-width:2.69003129;stroke-linecap:butt;stroke-linejoin:miter;stroke-miterlimit:4;stroke-dasharray:none;stroke-dashoffset:0;stroke-opacity:1"
     id="rect152-6-56"
     width="177.03595"
     height="47.340027"
     x="92.379173"
     y="425.32587"
     rx="13.71916"
     ry="0.18013902" />
  <rect
     style="opacity:1;vector-effect:none;fill:#ffffff;fill-opacity:1;stroke:#2dbc20;stroke-width:2.69003129;stroke-linecap:butt;stroke-linejoin:miter;stroke-miterlimit:4;stroke-dasharray:none;stroke-dashoffset:0;stroke-opacity:1"
     id="rect152-3-1-3-5-7"
     width="332.79785"
     height="81.394554"
     x="80.543037"
     y="513.52704"
     rx="13.71916"
     ry="0.18013902" />
  <text
     xml:space="preserve"
     style="font-style:normal;font-weight:normal;font-size:7.17341709px;line-height:1.25;font-family:sans-serif;letter-spacing:0px;word-spacing:0px;fill:#000000;fill-opacity:1;stroke:none;stroke-width:0.53800625"
     x="80.118462"
     y="506.2128"
     id="text216-9-2-2-6-4"><tspan
       sodipodi:role="line"
       x="80.118462"
       y="506.2128"
       style="font-size:12.91215038px;stroke-width:0.53800625"
       id="tspan291-8-6-9-5">systemd sandbox</tspan></text>
  <rect
     style="opacity:1;vector-effect:none;fill:#ffffff;fill-opacity:1;stroke:#008fff;stroke-width:2.69003129;stroke-linecap:butt;stroke-linejoin:miter;stroke-miterlimit:4;stroke-dasharray:none;stroke-dashoffset:0;stroke-opacity:1"
     id="rect152-6-2"
     width="309.24112"
     height="49.59465"
     x="92.379173"
     y="536.52026"
     rx="13.71916"
     ry="0.18013902" />
  <text
     xml:space="preserve"
     style="font-style:normal;font-weight:normal;font-size:7.17341709px;line-height:1.25;font-family:sans-serif;letter-spacing:0px;word-spacing:0px;fill:#000000;fill-opacity:1;stroke:none;stroke-width:0.53800625"
     x="5.8103242"
     y="86.922249"
     id="text216"><tspan
       sodipodi:role="line"
       id="tspan214"
       x="5.8103242"
       y="86.922249"
       style="font-size:17.21619987px;stroke-width:0.53800625">D-Bus</tspan></text>
  <rect
     style="opacity:1;vector-effect:none;fill:#ffffff;fill-opacity:1;stroke:#2dbc20;stroke-width:2.69003129;stroke-linecap:butt;stroke-linejoin:miter;stroke-miterlimit:4;stroke-dasharray:none;stroke-dashoffset:0;stroke-opacity:1"
     id="rect152-3-1-3-4"
     width="166.21002"
     height="110.50542"
     x="80.543037"
     y="103.29101"
     rx="13.71916"
     ry="0.18013902" />
  <text
     xml:space="preserve"
     style="font-style:normal;font-weight:normal;font-size:7.17341709px;line-height:1.25;font-family:sans-serif;letter-spacing:0px;word-spacing:0px;fill:#000000;fill-opacity:1;stroke:none;stroke-width:0.53800625"
     x="80.118462"
     y="96.155739"
     id="text216-9-2-2-7"><tspan
       sodipodi:role="line"
       x="80.118462"
       y="96.155739"
       style="font-size:12.91215038px;stroke-width:0.53800625"
       id="tspan291-8-6-6">systemd sandbox</tspan></text>
  <rect
     style="opacity:1;vector-effect:none;fill:#ffffff;fill-opacity:1;stroke:#008fff;stroke-width:2.69003129;stroke-linecap:butt;stroke-linejoin:miter;stroke-miterlimit:4;stroke-dasharray:none;stroke-dashoffset:0;stroke-opacity:1"
     id="rect152-3-1"
     width="144.09906"
     height="76.028717"
     x="92.379173"
     y="129.60825"
     rx="13.71916"
     ry="0.18013902" />
  <rect
     style="opacity:1;vector-effect:none;fill:#ffffff;fill-opacity:1;stroke:#ff8000;stroke-width:2.69003129;stroke-linecap:butt;stroke-linejoin:miter;stroke-miterlimit:4;stroke-dasharray:none;stroke-dashoffset:0;stroke-opacity:1"
     id="rect152-3-1-0"
     width="112.07703"
     height="33.394299"
     x="104.64693"
     y="159.43376"
     rx="13.71916"
     ry="0.18013902" />
  <text
     xml:space="preserve"
     style="font-style:normal;font-weight:normal;font-size:7.17341709px;line-height:1.25;font-family:sans-serif;letter-spacing:0px;word-spacing:0px;fill:#000000;fill-opacity:1;stroke:none;stroke-width:0.53800625"
     x="113.70181"
     y="180.88049"
     id="text216-2"><tspan
       sodipodi:role="line"
       id="tspan214-7"
       x="113.70181"
       y="180.88049"
       style="font-size:17.21619987px;stroke-width:0.53800625">Application</tspan></text>
  <text
     xml:space="preserve"
     style="font-style:normal;font-weight:normal;font-size:7.17341709px;line-height:1.25;font-family:sans-serif;letter-spacing:0px;word-spacing:0px;fill:#000000;fill-opacity:1;stroke:none;stroke-width:0.53800625"
     x="113.70181"
     y="453.74545"
     id="text216-7"><tspan
       sodipodi:role="line"
       id="tspan214-9"
       x="113.70181"
       y="453.74545"
       style="font-size:17.21619987px;stroke-width:0.53800625">Flatpak portals</tspan></text>
  <text
     xml:space="preserve"
     style="font-style:normal;font-weight:normal;font-size:7.17341709px;line-height:1.25;font-family:sans-serif;letter-spacing:0px;word-spacing:0px;fill:#000000;fill-opacity:1;stroke:none;stroke-width:0.53800625"
     x="113.70181"
     y="566.0672"
     id="text216-20"><tspan
       sodipodi:role="line"
       id="tspan214-2"
       x="113.70181"
       y="566.0672"
       style="font-size:17.21619987px;stroke-width:0.53800625">Session services (e.g. Tracker)</tspan></text>
  <rect
     style="opacity:1;vector-effect:none;fill:#ffffff;fill-opacity:1;stroke:#2dbc20;stroke-width:2.69003129;stroke-linecap:butt;stroke-linejoin:miter;stroke-miterlimit:4;stroke-dasharray:none;stroke-dashoffset:0;stroke-opacity:1"
     id="rect152-3-1-3-4-6"
     width="166.21002"
     height="110.50541"
     x="80.543037"
     y="254.55188"
     rx="13.71916"
     ry="0.18013902" />
  <text
     xml:space="preserve"
     style="font-style:normal;font-weight:normal;font-size:7.17341709px;line-height:1.25;font-family:sans-serif;letter-spacing:0px;word-spacing:0px;fill:#000000;fill-opacity:1;stroke:none;stroke-width:0.53800625"
     x="80.118462"
     y="247.41663"
     id="text216-9-2-2-7-1"><tspan
       sodipodi:role="line"
       x="80.118462"
       y="247.41663"
       style="font-size:12.91215038px;stroke-width:0.53800625"
       id="tspan291-8-6-6-8">systemd sandbox</tspan></text>
  <rect
     style="opacity:1;vector-effect:none;fill:#ffffff;fill-opacity:1;stroke:#008fff;stroke-width:2.69003129;stroke-linecap:butt;stroke-linejoin:miter;stroke-miterlimit:4;stroke-dasharray:none;stroke-dashoffset:0;stroke-opacity:1"
     id="rect152-3-1-7"
     width="144.09906"
     height="76.028717"
     x="92.379173"
     y="280.86911"
     rx="13.71916"
     ry="0.18013902" />
  <rect
     style="opacity:1;vector-effect:none;fill:#ffffff;fill-opacity:1;stroke:#ff8000;stroke-width:2.69003129;stroke-linecap:butt;stroke-linejoin:miter;stroke-miterlimit:4;stroke-dasharray:none;stroke-dashoffset:0;stroke-opacity:1"
     id="rect152-3-1-0-9"
     width="112.07703"
     height="33.394299"
     x="104.64693"
     y="310.69464"
     rx="13.71916"
     ry="0.18013902" />
  <text
     xml:space="preserve"
     style="font-style:normal;font-weight:normal;font-size:7.17341709px;line-height:1.25;font-family:sans-serif;letter-spacing:0px;word-spacing:0px;fill:#000000;fill-opacity:1;stroke:none;stroke-width:0.53800625"
     x="113.70181"
     y="332.14136"
     id="text216-2-2"><tspan
       sodipodi:role="line"
       id="tspan214-7-0"
       x="113.70181"
       y="332.14136"
       style="font-size:17.21619987px;stroke-width:0.53800625">Application</tspan></text>
  <path
     style="fill:none;stroke:#000000;stroke-width:2.69003129;stroke-linecap:butt;stroke-linejoin:miter;stroke-miterlimit:4;stroke-dasharray:none;stroke-opacity:1"
     d="M 80.543033,328.19087 H 29.59811"
     id="path1183-9"
     inkscape:connector-curvature="0"
     sodipodi:nodetypes="cc" />
  <rect
     style="opacity:1;vector-effect:none;fill:#ffffff;fill-opacity:1;stroke:#2dbc20;stroke-width:2.69003129;stroke-linecap:butt;stroke-linejoin:miter;stroke-miterlimit:4;stroke-dasharray:none;stroke-dashoffset:0;stroke-opacity:1"
     id="rect152-3-1-3-5-4"
     width="177.37306"
     height="81.394562"
     x="310.2778"
     y="274.7475"
     rx="13.71916"
     ry="0.18013902" />
  <path
     style="fill:none;stroke:#000000;stroke-width:2.69003129;stroke-linecap:butt;stroke-linejoin:miter;stroke-miterlimit:4;stroke-dasharray:none;stroke-opacity:1"
     d="M 310.27782,327.91882 H 246.75307"
     id="path1183-6"
     inkscape:connector-curvature="0"
     sodipodi:nodetypes="cc" />
  <path
     style="fill:none;stroke:#000000;stroke-width:5.38006258;stroke-linecap:round;stroke-linejoin:miter;stroke-miterlimit:4;stroke-dasharray:none;stroke-opacity:1"
     d="M 29.59811,100.18849 V 583.72965"
     id="path1181"
     inkscape:connector-curvature="0"
     sodipodi:nodetypes="cc" />
  <path
     style="fill:none;stroke:#000000;stroke-width:2.69003129;stroke-linecap:butt;stroke-linejoin:miter;stroke-miterlimit:4;stroke-dasharray:none;stroke-opacity:1"
     d="M 80.543033,176.95166 H 29.59811"
     id="path1183"
     inkscape:connector-curvature="0"
     sodipodi:nodetypes="cc" />
  <path
     style="fill:none;stroke:#000000;stroke-width:2.69003129;stroke-linecap:butt;stroke-linejoin:miter;stroke-miterlimit:4;stroke-dasharray:none;stroke-opacity:1"
     d="M 80.543033,447.68491 H 29.59811"
     id="path1183-7"
     inkscape:connector-curvature="0"
     sodipodi:nodetypes="cc" />
  <path
     style="fill:none;stroke:#000000;stroke-width:2.69003129;stroke-linecap:butt;stroke-linejoin:miter;stroke-miterlimit:4;stroke-dasharray:none;stroke-opacity:1"
     d="m 310.27782,169.71289 -63.52476,0.11436"
     id="path1183-6-1"
     inkscape:connector-curvature="0"
     sodipodi:nodetypes="cc" />
  <path
     style="fill:none;stroke:#000000;stroke-width:2.69003129;stroke-linecap:butt;stroke-linejoin:miter;stroke-miterlimit:4;stroke-dasharray:2.69003118, 2.69003118;stroke-dashoffset:0;stroke-opacity:1"
     d="M 104.64692,328.21253 H 80.543031"
     id="path1183-6-1-7-5-0-7"
     inkscape:connector-curvature="0"
     sodipodi:nodetypes="cc" />
  <path
     style="fill:none;stroke:#000000;stroke-width:2.69003129;stroke-linecap:butt;stroke-linejoin:miter;stroke-miterlimit:4;stroke-dasharray:none;stroke-opacity:1"
     d="M 310.27782,311.77863 H 294.46588 L 259.7508,181.54902 h -12.99774"
     id="path1183-6-1-9"
     inkscape:connector-curvature="0"
     sodipodi:nodetypes="cccc" />
  <path
     style="fill:none;stroke:#000000;stroke-width:2.69003129;stroke-linecap:butt;stroke-linejoin:miter;stroke-miterlimit:4;stroke-dasharray:2.69003138, 2.69003138;stroke-dashoffset:0;stroke-opacity:1"
     d="m 246.75306,169.82725 -30.0291,-0.11436"
     id="path1183-6-1-7"
     inkscape:connector-curvature="0"
     sodipodi:nodetypes="cc" />
  <path
     style="fill:none;stroke:#000000;stroke-width:2.69003129;stroke-linecap:butt;stroke-linejoin:miter;stroke-miterlimit:4;stroke-dasharray:2.69003131, 2.69003131;stroke-dashoffset:0;stroke-opacity:1"
     d="m 246.75306,181.54902 h -30.0291"
     id="path1183-6-1-7-8"
     inkscape:connector-curvature="0"
     sodipodi:nodetypes="cc" />
  <text
     xml:space="preserve"
     style="font-style:normal;font-weight:normal;font-size:7.17341709px;line-height:1.25;font-family:sans-serif;letter-spacing:0px;word-spacing:0px;fill:#000000;fill-opacity:1;stroke:none;stroke-width:0.53800625"
     x="93.039146"
     y="273.73718"
     id="text216-9-2-2-7-3-5"><tspan
       sodipodi:role="line"
       x="93.039146"
       y="273.73718"
       style="font-size:12.91215038px;stroke-width:0.53800625"
       id="tspan291-8-6-6-6-9">AppArmor sandbox</tspan></text>
  <path
     style="fill:none;stroke:#000000;stroke-width:2.69003129;stroke-linecap:butt;stroke-linejoin:miter;stroke-miterlimit:4;stroke-dasharray:2.69003131, 2.69003131;stroke-dashoffset:0;stroke-opacity:1"
     d="M 246.75307,327.91882 H 216.72396"
     id="path1183-6-1-7-4"
     inkscape:connector-curvature="0"
     sodipodi:nodetypes="cc" />
  <path
     style="fill:none;stroke:#000000;stroke-width:2.69003129;stroke-linecap:butt;stroke-linejoin:miter;stroke-miterlimit:4;stroke-dasharray:2.69003125, 2.69003125;stroke-dashoffset:0;stroke-opacity:1"
     d="M 104.64692,176.95166 H 80.543033"
     id="path1183-6-1-7-5-0"
     inkscape:connector-curvature="0"
     sodipodi:nodetypes="cc" />
  <path
     style="fill:none;stroke:#000000;stroke-width:2.69003129;stroke-linecap:butt;stroke-linejoin:miter;stroke-miterlimit:4;stroke-dasharray:2.69003125, 2.69003125;stroke-dashoffset:0;stroke-opacity:1"
     d="M 92.524303,447.68491 H 80.543033"
     id="path1183-6-1-7-5-3"
     inkscape:connector-curvature="0"
     sodipodi:nodetypes="cc" />
  <path
     style="fill:none;stroke:#000000;stroke-width:2.69003129;stroke-linecap:butt;stroke-linejoin:miter;stroke-miterlimit:4;stroke-dasharray:none;stroke-opacity:1"
     d="M 80.397913,562.27912 H 29.452977"
     id="path1183-7-2"
     inkscape:connector-curvature="0"
     sodipodi:nodetypes="cc" />
  <path
     style="fill:none;stroke:#000000;stroke-width:2.69003129;stroke-linecap:butt;stroke-linejoin:miter;stroke-miterlimit:4;stroke-dasharray:2.69003118, 2.69003118;stroke-dashoffset:0;stroke-opacity:1"
     d="M 92.379173,562.27912 H 80.397913"
     id="path1183-6-1-7-5-3-5"
     inkscape:connector-curvature="0"
     sodipodi:nodetypes="cc" />
  <flowRoot
     xml:space="preserve"
     id="flowRoot1547"
     style="font-style:normal;font-weight:normal;font-size:13.33333302px;line-height:1.25;font-family:sans-serif;letter-spacing:0px;word-spacing:0px;fill:#000000;fill-opacity:1;stroke:none"
     transform="matrix(0.75,0,0,0.75,-61.413217,53.870766)"><flowRegion
       id="flowRegion1549"><rect
         id="rect1551"
         width="65.471748"
         height="60.795197"
         x="-385.60312"
         y="1141.5043" /></flowRegion><flowPara
       id="flowPara1553" /></flowRoot>  <rect
     style="opacity:1;vector-effect:none;fill:#ffffff;fill-opacity:1;stroke:#008fff;stroke-width:2.69003129;stroke-linecap:butt;stroke-linejoin:miter;stroke-miterlimit:4;stroke-dasharray:none;stroke-dashoffset:0;stroke-opacity:1"
     id="rect152-6-56-4"
     width="152.84045"
     height="44.815697"
     x="322.11395"
     y="300.97598"
     rx="13.71916"
     ry="0.18013902" />
  <text
     xml:space="preserve"
     style="font-style:normal;font-weight:normal;font-size:7.17341709px;line-height:1.25;font-family:sans-serif;letter-spacing:0px;word-spacing:0px;fill:#000000;fill-opacity:1;stroke:none;stroke-width:0.53800625"
     x="343.43658"
     y="328.13342"
     id="text216-7-3"><tspan
       sodipodi:role="line"
       id="tspan214-9-0"
       x="343.43658"
       y="328.13342"
       style="font-size:17.21619987px;stroke-width:0.53800625">Compositor</tspan></text>
  <path
     style="fill:none;stroke:#000000;stroke-width:2.69003129;stroke-linecap:butt;stroke-linejoin:miter;stroke-miterlimit:4;stroke-dasharray:2.69003118, 2.69003118;stroke-dashoffset:0;stroke-opacity:1"
     d="M 322.25909,327.91882 H 310.27782"
     id="path1183-6-1-7-5-3-7"
     inkscape:connector-curvature="0"
     sodipodi:nodetypes="cc" />
  <path
     style="fill:none;stroke:#000000;stroke-width:2.69003129;stroke-linecap:butt;stroke-linejoin:miter;stroke-miterlimit:4;stroke-dasharray:2.69003112, 2.69003112;stroke-dashoffset:0;stroke-opacity:1"
     d="M 322.25906,311.77863 H 310.27779"
     id="path1183-6-1-7-5-3-7-8"
     inkscape:connector-curvature="0"
     sodipodi:nodetypes="cc" />
  <rect
     style="opacity:1;vector-effect:none;fill:#ffffff;fill-opacity:1;stroke:#2dbc20;stroke-width:2.69003129;stroke-linecap:butt;stroke-linejoin:miter;stroke-miterlimit:4;stroke-dasharray:none;stroke-dashoffset:0;stroke-opacity:1"
     id="rect152-3-1-3-5-4-6"
     width="177.82399"
     height="81.394547"
     x="310.2778"
     y="132.48581"
     rx="13.71916"
     ry="0.18013902" />
  <rect
     style="opacity:1;vector-effect:none;fill:#ffffff;fill-opacity:1;stroke:#008fff;stroke-width:2.69003129;stroke-linecap:butt;stroke-linejoin:miter;stroke-miterlimit:4;stroke-dasharray:none;stroke-dashoffset:0;stroke-opacity:1"
     id="rect152-6-56-4-4"
     width="152.92249"
     height="44.317108"
     x="322.11395"
     y="159.21289"
     rx="13.71916"
     ry="0.18013902" />
  <text
     xml:space="preserve"
     style="font-style:normal;font-weight:normal;font-size:7.17341709px;line-height:1.25;font-family:sans-serif;letter-spacing:0px;word-spacing:0px;fill:#000000;fill-opacity:1;stroke:none;stroke-width:0.53800625"
     x="343.43658"
     y="186.12103"
     id="text216-7-3-3"><tspan
       sodipodi:role="line"
       id="tspan214-9-0-1"
       x="343.43658"
       y="186.12103"
       style="font-size:17.21619987px;stroke-width:0.53800625">PipeWire</tspan></text>
  <path
     style="fill:none;stroke:#000000;stroke-width:2.69003129;stroke-linecap:butt;stroke-linejoin:miter;stroke-miterlimit:4;stroke-dasharray:2.69003112, 2.69003112;stroke-dashoffset:0;stroke-opacity:1"
     d="M 322.25909,169.71289 H 310.27782"
     id="path1183-6-1-7-5-3-7-4"
     inkscape:connector-curvature="0"
     sodipodi:nodetypes="cc" />
  <rect
     style="opacity:1;vector-effect:none;fill:#ffffff;fill-opacity:1;stroke:#2dbc20;stroke-width:2.69003129;stroke-linecap:butt;stroke-linejoin:miter;stroke-miterlimit:4;stroke-dasharray:none;stroke-dashoffset:0;stroke-opacity:1"
     id="rect152-3-1-3-5-4-6-2"
     width="178.72585"
     height="81.394547"
     x="310.2778"
     y="24.624432"
     rx="13.71916"
     ry="0.18013902" />
  <rect
     style="opacity:1;vector-effect:none;fill:#ffffff;fill-opacity:1;stroke:#008fff;stroke-width:2.69003129;stroke-linecap:butt;stroke-linejoin:miter;stroke-miterlimit:4;stroke-dasharray:none;stroke-dashoffset:0;stroke-opacity:1"
     id="rect152-6-56-4-4-8"
     width="153.02722"
     height="45.134575"
     x="322.11395"
     y="50.53405"
     rx="13.71916"
     ry="0.18013902" />
  <text
     xml:space="preserve"
     style="font-style:normal;font-weight:normal;font-size:7.17341709px;line-height:1.25;font-family:sans-serif;letter-spacing:0px;word-spacing:0px;fill:#000000;fill-opacity:1;stroke:none;stroke-width:0.53800625"
     x="343.43658"
     y="79.519585"
     id="text216-7-3-3-9"><tspan
       sodipodi:role="line"
       id="tspan214-9-0-1-2"
       x="343.43658"
       y="79.519585"
       style="font-size:17.21619987px;stroke-width:0.53800625">WirePlumber</tspan></text>
  <path
     style="fill:none;stroke:#000000;stroke-width:2.69003129;stroke-linecap:butt;stroke-linejoin:miter;stroke-miterlimit:4;stroke-dasharray:none;stroke-opacity:1"
     d="m 457.82531,132.48581 -0.11437,-26.46683"
     id="path1183-6-1-4"
     inkscape:connector-curvature="0"
     sodipodi:nodetypes="cc" />
  <path
     style="fill:none;stroke:#000000;stroke-width:2.69003129;stroke-linecap:butt;stroke-linejoin:miter;stroke-miterlimit:4;stroke-dasharray:2.69003105, 2.69003105;stroke-dashoffset:0;stroke-opacity:1"
     d="m 457.82531,132.48581 v 8.37255"
     id="path1183-6-1-7-5-3-7-4-9"
     inkscape:connector-curvature="0"
     sodipodi:nodetypes="cc" />
  <path
     style="fill:none;stroke:#000000;stroke-width:2.69003129;stroke-linecap:butt;stroke-linejoin:miter;stroke-miterlimit:4;stroke-dasharray:2.69003105, 2.69003105;stroke-dashoffset:0;stroke-opacity:1"
     d="M 457.71094,95.668627 V 106.01898"
     id="path1183-6-1-7-5-3-7-4-5"
     inkscape:connector-curvature="0"
     sodipodi:nodetypes="cc" />
  <rect
     style="opacity:1;vector-effect:none;fill:#ffffff;fill-opacity:1;stroke:#b52800;stroke-width:2.69003129;stroke-linecap:butt;stroke-linejoin:miter;stroke-miterlimit:4;stroke-dasharray:none;stroke-dashoffset:0;stroke-opacity:1"
     id="rect152-6-56-4-6"
     width="124.72803"
     height="62.671631"
     x="524.61395"
     y="277.12006"
     rx="13.71916"
     ry="13.708056" />
  <text
     xml:space="preserve"
     style="font-style:normal;font-weight:normal;font-size:7.17341709px;line-height:1.25;font-family:sans-serif;letter-spacing:0px;word-spacing:0px;fill:#000000;fill-opacity:1;stroke:none;stroke-width:0.53800625"
     x="545.93658"
     y="313.20544"
     id="text216-7-3-7"><tspan
       sodipodi:role="line"
       id="tspan214-9-0-5"
       x="545.93658"
       y="313.20544"
       style="font-size:17.21619987px;stroke-width:0.53800625">Display</tspan></text>
  <rect
     style="opacity:1;vector-effect:none;fill:#ffffff;fill-opacity:1;stroke:#b52800;stroke-width:2.69003129;stroke-linecap:butt;stroke-linejoin:miter;stroke-miterlimit:4;stroke-dasharray:none;stroke-dashoffset:0;stroke-opacity:1"
     id="rect152-6-56-4-6-3"
     width="124.72803"
     height="62.671631"
     x="524.61395"
     y="352.12006"
     rx="13.71916"
     ry="13.708056" />
  <text
     xml:space="preserve"
     style="font-style:normal;font-weight:normal;font-size:7.17341709px;line-height:1.25;font-family:sans-serif;letter-spacing:0px;word-spacing:0px;fill:#000000;fill-opacity:1;stroke:none;stroke-width:0.53800625"
     x="545.93658"
     y="378.84918"
     id="text216-7-3-7-5"><tspan
       sodipodi:role="line"
       id="tspan214-9-0-5-6"
       x="545.93658"
       y="378.84918"
       style="font-size:17.21619987px;stroke-width:0.53800625">Input</tspan><tspan
       sodipodi:role="line"
       x="545.93658"
       y="400.36945"
       style="font-size:17.21619987px;stroke-width:0.53800625"
       id="tspan945">devices</tspan></text>
  <rect
     style="opacity:1;vector-effect:none;fill:#ffffff;fill-opacity:1;stroke:#b52800;stroke-width:2.69003129;stroke-linecap:butt;stroke-linejoin:miter;stroke-miterlimit:4;stroke-dasharray:none;stroke-dashoffset:0;stroke-opacity:1"
     id="rect152-6-56-4-6-3-2"
     width="124.72803"
     height="62.671631"
     x="524.61395"
     y="154.12006"
     rx="13.71916"
     ry="13.708056" />
  <text
     xml:space="preserve"
     style="font-style:normal;font-weight:normal;font-size:7.17341709px;line-height:1.25;font-family:sans-serif;letter-spacing:0px;word-spacing:0px;fill:#000000;fill-opacity:1;stroke:none;stroke-width:0.53800625"
     x="545.93658"
     y="180.84918"
     id="text216-7-3-7-5-9"><tspan
       sodipodi:role="line"
       id="tspan214-9-0-5-6-1"
       x="545.93658"
       y="180.84918"
       style="font-size:17.21619987px;stroke-width:0.53800625">Audio</tspan><tspan
       sodipodi:role="line"
       x="545.93658"
       y="202.36943"
       style="font-size:17.21619987px;stroke-width:0.53800625"
       id="tspan945-2">devices</tspan></text>
  <rect
     style="opacity:1;vector-effect:none;fill:#ffffff;fill-opacity:1;stroke:#b52800;stroke-width:2.69003129;stroke-linecap:butt;stroke-linejoin:miter;stroke-miterlimit:4;stroke-dasharray:none;stroke-dashoffset:0;stroke-opacity:1"
     id="rect152-6-56-4-6-3-7"
     width="124.72803"
     height="62.671631"
     x="324.40085"
     y="409.34006"
     rx="13.71916"
     ry="13.708056" />
  <text
     xml:space="preserve"
     style="font-style:normal;font-weight:normal;font-size:7.17341709px;line-height:1.25;font-family:sans-serif;letter-spacing:0px;word-spacing:0px;fill:#000000;fill-opacity:1;stroke:none;stroke-width:0.53800625"
     x="345.72348"
     y="436.06918"
     id="text216-7-3-7-5-0"><tspan
       sodipodi:role="line"
       x="345.72348"
       y="436.06918"
       style="font-size:17.21619987px;stroke-width:0.53800625"
       id="tspan945-3">User</tspan><tspan
       sodipodi:role="line"
       x="345.72348"
       y="457.58945"
       style="font-size:17.21619987px;stroke-width:0.53800625"
       id="tspan1009">data</tspan></text>
  <flowRoot
     xml:space="preserve"
     id="flowRoot1011"
     style="font-style:normal;font-weight:normal;font-size:10px;line-height:1.25;font-family:sans-serif;letter-spacing:0px;word-spacing:0px;fill:#000000;fill-opacity:1;stroke:none;stroke-width:0.75"><flowRegion
       id="flowRegion1013"
       style="stroke-width:0.75"><rect
         id="rect1015"
         width="183.07774"
         height="91.087929"
         x="488.8085"
         y="444.58813"
         style="stroke-width:0.5625" /></flowRegion><flowPara
       id="flowPara1017"
       style="stroke-width:0.75" /></flowRoot>  <path
     style="fill:none;stroke:#000000;stroke-width:2.69003129;stroke-linecap:butt;stroke-linejoin:miter;stroke-miterlimit:4;stroke-dasharray:none;stroke-opacity:1"
     d="M 324.40085,441.33006 H 281.36448"
     id="path1183-6-6"
     inkscape:connector-curvature="0"
     sodipodi:nodetypes="cc" />
  <path
     style="fill:none;stroke:#000000;stroke-width:2.69003129;stroke-linecap:butt;stroke-linejoin:miter;stroke-miterlimit:4;stroke-dasharray:2.69003124, 2.69003124;stroke-dashoffset:0;stroke-opacity:1"
     d="M 281.36448,441.33006 H 269.41513"
     id="path1183-6-1-7-4-0"
     inkscape:connector-curvature="0"
     sodipodi:nodetypes="cc" />
  <path
     style="fill:none;stroke:#000000;stroke-width:2.69003129;stroke-linecap:butt;stroke-linejoin:miter;stroke-miterlimit:4;stroke-dasharray:none;stroke-opacity:1"
     d="M 524.61395,387.73094 H 511.80201 L 497.6486,336.57996 h -9.99774"
     id="path1183-6-1-9-6"
     inkscape:connector-curvature="0"
     sodipodi:nodetypes="cccc" />
  <path
     style="fill:none;stroke:#000000;stroke-width:2.69003129;stroke-linecap:butt;stroke-linejoin:miter;stroke-miterlimit:4;stroke-dasharray:2.69003124, 2.69003124;stroke-dashoffset:0;stroke-opacity:1"
     d="M 487.65086,336.57996 H 474.95441"
     id="path1183-6-1-7-8-2"
     inkscape:connector-curvature="0"
     sodipodi:nodetypes="cc" />
  <path
     style="fill:none;stroke:#000000;stroke-width:2.69003129;stroke-linecap:butt;stroke-linejoin:miter;stroke-miterlimit:4;stroke-dasharray:2.69003118, 2.69003118;stroke-dashoffset:0;stroke-opacity:1"
     d="M 487.11739,312.22695 H 474.95441"
     id="path1183-6-1-7-8-2-6"
     inkscape:connector-curvature="0"
     sodipodi:nodetypes="cc" />
  <path
     style="fill:none;stroke:#000000;stroke-width:2.69003129;stroke-linecap:butt;stroke-linejoin:miter;stroke-miterlimit:4;stroke-dasharray:none;stroke-opacity:1"
     d="M 524.61395,312.22695 H 487.11739"
     id="path1183-6-18"
     inkscape:connector-curvature="0"
     sodipodi:nodetypes="cc" />
  <path
     style="fill:none;stroke:#000000;stroke-width:2.69003129;stroke-linecap:butt;stroke-linejoin:miter;stroke-miterlimit:4;stroke-dasharray:2.69003112, 2.69003112;stroke-dashoffset:0;stroke-opacity:1"
     d="M 487.11739,184.72695 H 475.03647"
     id="path1183-6-1-7-8-2-6-7"
     inkscape:connector-curvature="0"
     sodipodi:nodetypes="cc" />
  <path
     style="fill:none;stroke:#000000;stroke-width:2.69003129;stroke-linecap:butt;stroke-linejoin:miter;stroke-miterlimit:4;stroke-dasharray:none;stroke-opacity:1"
     d="M 524.61395,184.72695 H 487.11739"
     id="path1183-6-18-9"
     inkscape:connector-curvature="0"
     sodipodi:nodetypes="cc" />
  <text
     xml:space="preserve"
     style="font-style:normal;font-weight:normal;font-size:7.17341709px;line-height:1.25;font-family:sans-serif;letter-spacing:0px;word-spacing:0px;fill:#000000;fill-opacity:1;stroke:none;stroke-width:0.53800625"
     x="93.039146"
     y="122.4763"
     id="text216-9-2-2-7-3"><tspan
       sodipodi:role="line"
       x="93.039146"
       y="122.4763"
       style="font-size:12.91215038px;stroke-width:0.53800625"
       id="tspan291-8-6-6-6">AppArmor sandbox</tspan></text>
  <text
     xml:space="preserve"
     style="font-style:normal;font-weight:normal;font-size:7.17341709px;line-height:1.25;font-family:sans-serif;letter-spacing:0px;word-spacing:0px;fill:#000000;fill-opacity:1;stroke:none;stroke-width:0.53800625"
     x="104.04218"
     y="152.0986"
     id="text216-9-2-2-7-3-7"><tspan
       sodipodi:role="line"
       x="104.04218"
       y="152.0986"
       style="font-size:12.91215038px;stroke-width:0.53800625"
       id="tspan291-8-6-6-6-5">Flatpak sandbox</tspan></text>
  <text
     xml:space="preserve"
     style="font-style:normal;font-weight:normal;font-size:7.17341709px;line-height:1.25;font-family:sans-serif;letter-spacing:0px;word-spacing:0px;fill:#000000;fill-opacity:1;stroke:none;stroke-width:0.53800625"
     x="104.02851"
     y="303.35947"
     id="text216-9-2-2-7-3-7-2"><tspan
       sodipodi:role="line"
       x="104.02851"
       y="303.35947"
       style="font-size:12.91215038px;stroke-width:0.53800625"
       id="tspan291-8-6-6-6-5-2">Flatpak sandbox</tspan></text>
  <text
     xml:space="preserve"
     style="font-style:normal;font-weight:normal;font-size:7.17341709px;line-height:1.25;font-family:sans-serif;letter-spacing:0px;word-spacing:0px;fill:#000000;fill-opacity:1;stroke:none;stroke-width:0.53800625"
     x="93.039146"
     y="418.56079"
     id="text216-9-2-2-7-3-5-8"><tspan
       sodipodi:role="line"
       x="93.039146"
       y="418.56079"
       style="font-size:12.91215038px;stroke-width:0.53800625"
       id="tspan291-8-6-6-6-9-9">AppArmor sandbox</tspan></text>
  <text
     xml:space="preserve"
     style="font-style:normal;font-weight:normal;font-size:7.17341709px;line-height:1.25;font-family:sans-serif;letter-spacing:0px;word-spacing:0px;fill:#000000;fill-opacity:1;stroke:none;stroke-width:0.53800625"
     x="93.039146"
     y="530.31543"
     id="text216-9-2-2-7-3-5-7"><tspan
       sodipodi:role="line"
       x="93.039146"
       y="530.31543"
       style="font-size:12.91215038px;stroke-width:0.53800625"
       id="tspan291-8-6-6-6-9-3">AppArmor sandbox</tspan></text>
  <text
     xml:space="preserve"
     style="font-style:normal;font-weight:normal;font-size:7.17341709px;line-height:1.25;font-family:sans-serif;letter-spacing:0px;word-spacing:0px;fill:#000000;fill-opacity:1;stroke:none;stroke-width:0.53800625"
     x="310.61584"
     y="18.265297"
     id="text216-9-2-2-7-6"><tspan
       sodipodi:role="line"
       x="310.61584"
       y="18.265297"
       style="font-size:12.91215038px;stroke-width:0.53800625"
       id="tspan291-8-6-6-1">systemd sandbox</tspan></text>
  <text
     xml:space="preserve"
     style="font-style:normal;font-weight:normal;font-size:7.17341709px;line-height:1.25;font-family:sans-serif;letter-spacing:0px;word-spacing:0px;fill:#000000;fill-opacity:1;stroke:none;stroke-width:0.53800625"
     x="323.53653"
     y="44.585857"
     id="text216-9-2-2-7-3-2"><tspan
       sodipodi:role="line"
       x="323.53653"
       y="44.585857"
       style="font-size:12.91215038px;stroke-width:0.53800625"
       id="tspan291-8-6-6-6-93">AppArmor sandbox</tspan></text>
  <text
     xml:space="preserve"
     style="font-style:normal;font-weight:normal;font-size:7.17341709px;line-height:1.25;font-family:sans-serif;letter-spacing:0px;word-spacing:0px;fill:#000000;fill-opacity:1;stroke:none;stroke-width:0.53800625"
     x="310.61584"
     y="125.66716"
     id="text216-9-2-2-7-6-1"><tspan
       sodipodi:role="line"
       x="310.61584"
       y="125.66716"
       style="font-size:12.91215038px;stroke-width:0.53800625"
       id="tspan291-8-6-6-1-9">systemd sandbox</tspan></text>
  <text
     xml:space="preserve"
     style="font-style:normal;font-weight:normal;font-size:7.17341709px;line-height:1.25;font-family:sans-serif;letter-spacing:0px;word-spacing:0px;fill:#000000;fill-opacity:1;stroke:none;stroke-width:0.53800625"
     x="323.53653"
     y="151.98772"
     id="text216-9-2-2-7-3-2-4"><tspan
       sodipodi:role="line"
       x="323.53653"
       y="151.98772"
       style="font-size:12.91215038px;stroke-width:0.53800625"
       id="tspan291-8-6-6-6-93-7">AppArmor sandbox</tspan></text>
  <text
     xml:space="preserve"
     style="font-style:normal;font-weight:normal;font-size:7.17341709px;line-height:1.25;font-family:sans-serif;letter-spacing:0px;word-spacing:0px;fill:#000000;fill-opacity:1;stroke:none;stroke-width:0.53800625"
     x="310.61584"
     y="268.16718"
     id="text216-9-2-2-7-6-3"><tspan
       sodipodi:role="line"
       x="310.61584"
       y="268.16718"
       style="font-size:12.91215038px;stroke-width:0.53800625"
       id="tspan291-8-6-6-1-6">systemd sandbox</tspan></text>
  <text
     xml:space="preserve"
     style="font-style:normal;font-weight:normal;font-size:7.17341709px;line-height:1.25;font-family:sans-serif;letter-spacing:0px;word-spacing:0px;fill:#000000;fill-opacity:1;stroke:none;stroke-width:0.53800625"
     x="323.53653"
     y="294.48773"
     id="text216-9-2-2-7-3-2-1"><tspan
       sodipodi:role="line"
       x="323.53653"
       y="294.48773"
       style="font-size:12.91215038px;stroke-width:0.53800625"
       id="tspan291-8-6-6-6-93-0">AppArmor sandbox</tspan></text>
</svg>
