<?xml version="1.0" encoding="UTF-8" standalone="no"?>
<svg
   xmlns:osb="http://www.openswatchbook.org/uri/2009/osb"
   xmlns:dc="http://purl.org/dc/elements/1.1/"
   xmlns:cc="http://creativecommons.org/ns#"
   xmlns:rdf="http://www.w3.org/1999/02/22-rdf-syntax-ns#"
   xmlns:svg="http://www.w3.org/2000/svg"
   xmlns="http://www.w3.org/2000/svg"
   xmlns:sodipodi="http://sodipodi.sourceforge.net/DTD/sodipodi-0.dtd"
   xmlns:inkscape="http://www.inkscape.org/namespaces/inkscape"
   width="210mm"
   height="240mm"
   viewBox="0 0 210 240"
   version="1.1"
   id="svg8"
   inkscape:version="1.0.1 (3bc2e813f5, 2020-09-07)"
   sodipodi:docname="ostree_web_upgrade.svg">
  <defs
     id="defs2">
    <marker
       inkscape:isstock="true"
       style="overflow:visible"
       id="marker1156"
       refX="0"
       refY="0"
       orient="auto"
       inkscape:stockid="Arrow1Lstart">
      <path
         transform="matrix(0.8,0,0,0.8,10,0)"
         style="fill:#000000;fill-opacity:1;fill-rule:evenodd;stroke:#000000;stroke-width:1pt;stroke-opacity:1"
         d="M 0,0 5,-5 -12.5,0 5,5 Z"
         id="path1154" />
    </marker>
    <marker
       inkscape:isstock="true"
       style="overflow:visible"
       id="marker1146"
       refX="0"
       refY="0"
       orient="auto"
       inkscape:stockid="Arrow1Lstart">
      <path
         transform="matrix(0.8,0,0,0.8,10,0)"
         style="fill:#000000;fill-opacity:1;fill-rule:evenodd;stroke:#000000;stroke-width:1pt;stroke-opacity:1"
         d="M 0,0 5,-5 -12.5,0 5,5 Z"
         id="path1144" />
    </marker>
    <marker
       inkscape:isstock="true"
       style="overflow:visible"
       id="marker8699"
       refX="0"
       refY="0"
       orient="auto"
       inkscape:stockid="Arrow1Lend">
      <path
         transform="matrix(-0.8,0,0,-0.8,-10,0)"
         style="fill:#000000;fill-opacity:1;fill-rule:evenodd;stroke:#000000;stroke-width:1pt;stroke-opacity:1"
         d="M 0,0 5,-5 -12.5,0 5,5 Z"
         id="path8697" />
    </marker>
    <linearGradient
       id="linearGradient7949"
       osb:paint="solid">
      <stop
         style="stop-color:#2c5aa0;stop-opacity:1;"
         offset="0"
         id="stop7947" />
    </linearGradient>
    <linearGradient
       id="linearGradient6485"
       osb:paint="solid">
      <stop
         style="stop-color:#2c5aa0;stop-opacity:1;"
         offset="0"
         id="stop6483" />
    </linearGradient>
    <linearGradient
       id="linearGradient4022"
       osb:paint="solid">
      <stop
         style="stop-color:#beb7c8;stop-opacity:1;"
         offset="0"
         id="stop4020" />
    </linearGradient>
    <linearGradient
       id="linearGradient4006"
       osb:paint="solid">
      <stop
         style="stop-color:#beb7c8;stop-opacity:1;"
         offset="0"
         id="stop4004" />
    </linearGradient>
    <linearGradient
       id="linearGradient3946"
       osb:paint="solid">
      <stop
         style="stop-color:#beb7c8;stop-opacity:1;"
         offset="0"
         id="stop3944" />
    </linearGradient>
    <marker
       inkscape:stockid="Arrow1Lend"
       orient="auto"
       refY="0"
       refX="0"
       id="marker1952"
       style="overflow:visible"
       inkscape:isstock="true">
      <path
         id="path1950"
         d="M 0,0 5,-5 -12.5,0 5,5 Z"
         style="fill:#000000;fill-opacity:1;fill-rule:evenodd;stroke:#000000;stroke-width:1pt;stroke-opacity:1"
         transform="matrix(-0.8,0,0,-0.8,-10,0)" />
    </marker>
    <marker
       inkscape:stockid="Arrow1Lend"
       orient="auto"
       refY="0"
       refX="0"
       id="marker9852"
       style="overflow:visible"
       inkscape:isstock="true">
      <path
         id="path9850"
         d="M 0,0 5,-5 -12.5,0 5,5 Z"
         style="fill:#000000;fill-opacity:1;fill-rule:evenodd;stroke:#000000;stroke-width:1pt;stroke-opacity:1"
         transform="matrix(-0.8,0,0,-0.8,-10,0)" />
    </marker>
    <marker
       inkscape:isstock="true"
       style="overflow:visible"
       id="marker8267"
       refX="0"
       refY="0"
       orient="auto"
       inkscape:stockid="Arrow1Lend">
      <path
         transform="matrix(-0.8,0,0,-0.8,-10,0)"
         style="fill:#000000;fill-opacity:1;fill-rule:evenodd;stroke:#000000;stroke-width:1pt;stroke-opacity:1"
         d="M 0,0 5,-5 -12.5,0 5,5 Z"
         id="path8265" />
    </marker>
    <marker
       inkscape:isstock="true"
       style="overflow:visible"
       id="marker8101"
       refX="0"
       refY="0"
       orient="auto"
       inkscape:stockid="Arrow1Lend">
      <path
         transform="matrix(-0.8,0,0,-0.8,-10,0)"
         style="fill:#000000;fill-opacity:1;fill-rule:evenodd;stroke:#000000;stroke-width:1pt;stroke-opacity:1"
         d="M 0,0 5,-5 -12.5,0 5,5 Z"
         id="path8099" />
    </marker>
    <marker
       inkscape:isstock="true"
       style="overflow:visible"
       id="marker7875"
       refX="0"
       refY="0"
       orient="auto"
       inkscape:stockid="Arrow1Lend">
      <path
         transform="matrix(-0.8,0,0,-0.8,-10,0)"
         style="fill:#000000;fill-opacity:1;fill-rule:evenodd;stroke:#000000;stroke-width:1pt;stroke-opacity:1"
         d="M 0,0 5,-5 -12.5,0 5,5 Z"
         id="path7873" />
    </marker>
    <marker
       inkscape:stockid="Tail"
       orient="auto"
       refY="0"
       refX="0"
       id="Tail"
       style="overflow:visible"
       inkscape:isstock="true">
      <g
         id="g1044"
         transform="scale(-1.2)"
         style="fill:#000000;fill-opacity:1;stroke:#000000;stroke-opacity:1">
        <path
           id="path1032"
           d="M -3.8048674,-3.9585227 0.54352094,0"
           style="fill:#000000;fill-opacity:1;fill-rule:evenodd;stroke:#000000;stroke-width:0.8;stroke-linecap:round;stroke-opacity:1" />
        <path
           id="path1034"
           d="M -1.2866832,-3.9585227 3.0617053,0"
           style="fill:#000000;fill-opacity:1;fill-rule:evenodd;stroke:#000000;stroke-width:0.8;stroke-linecap:round;stroke-opacity:1" />
        <path
           id="path1036"
           d="M 1.3053582,-3.9585227 5.6537466,0"
           style="fill:#000000;fill-opacity:1;fill-rule:evenodd;stroke:#000000;stroke-width:0.8;stroke-linecap:round;stroke-opacity:1" />
        <path
           id="path1038"
           d="M -3.8048674,4.1775838 0.54352094,0.21974226"
           style="fill:#000000;fill-opacity:1;fill-rule:evenodd;stroke:#000000;stroke-width:0.8;stroke-linecap:round;stroke-opacity:1" />
        <path
           id="path1040"
           d="M -1.2866832,4.1775838 3.0617053,0.21974226"
           style="fill:#000000;fill-opacity:1;fill-rule:evenodd;stroke:#000000;stroke-width:0.8;stroke-linecap:round;stroke-opacity:1" />
        <path
           id="path1042"
           d="M 1.3053582,4.1775838 5.6537466,0.21974226"
           style="fill:#000000;fill-opacity:1;fill-rule:evenodd;stroke:#000000;stroke-width:0.8;stroke-linecap:round;stroke-opacity:1" />
      </g>
    </marker>
    <marker
       inkscape:isstock="true"
       style="overflow:visible"
       id="marker7050"
       refX="0"
       refY="0"
       orient="auto"
       inkscape:stockid="Arrow1Lend">
      <path
         transform="matrix(-0.8,0,0,-0.8,-10,0)"
         style="fill:#000000;fill-opacity:1;fill-rule:evenodd;stroke:#000000;stroke-width:1pt;stroke-opacity:1"
         d="M 0,0 5,-5 -12.5,0 5,5 Z"
         id="path7048" />
    </marker>
    <linearGradient
       id="linearGradient5506"
       osb:paint="solid">
      <stop
         style="stop-color:#a02c2c;stop-opacity:1;"
         offset="0"
         id="stop5504" />
    </linearGradient>
    <inkscape:perspective
       sodipodi:type="inkscape:persp3d"
       inkscape:vp_x="490.15103 : 803.81765 : 1"
       inkscape:vp_y="5.2625376 : 6320.6904 : 0"
       inkscape:vp_z="1305.2059 : 1194.1012 : 1"
       inkscape:persp3d-origin="897.418 : 686.08526 : 1"
       id="perspective1657" />
    <inkscape:perspective
       sodipodi:type="inkscape:persp3d"
       inkscape:vp_x="465.44792 : 795.31335 : 1"
       inkscape:vp_y="6.3022286 : 4351.6722 : 0"
       inkscape:vp_z="1441.5286 : 1064.0158 : 1"
       inkscape:persp3d-origin="953.17642 : 714.25684 : 1"
       id="perspective1612" />
    <inkscape:perspective
       sodipodi:type="inkscape:persp3d"
       inkscape:vp_x="447.72224 : 700.20607 : 1"
       inkscape:vp_y="6.3022286 : 4351.6722 : 0"
       inkscape:vp_z="1423.803 : 968.90857 : 1"
       inkscape:persp3d-origin="935.45074 : 619.14957 : 1"
       id="perspective1578" />
    <inkscape:perspective
       sodipodi:type="inkscape:persp3d"
       inkscape:vp_x="459.70565 : 681.94774 : 1"
       inkscape:vp_y="6.3022286 : 4351.6722 : 0"
       inkscape:vp_z="1435.7865 : 950.65027 : 1"
       inkscape:persp3d-origin="947.43415 : 600.89124 : 1"
       id="perspective1548" />
    <inkscape:perspective
       sodipodi:type="inkscape:persp3d"
       inkscape:vp_x="413.09842 : 668.84253 : 1"
       inkscape:vp_y="6.3022286 : 4351.6722 : 0"
       inkscape:vp_z="1389.1793 : 937.54504 : 1"
       inkscape:persp3d-origin="900.82693 : 587.78603 : 1"
       id="perspective1532" />
    <inkscape:perspective
       sodipodi:type="inkscape:persp3d"
       inkscape:vp_x="453.72508 : 686.31541 : 1"
       inkscape:vp_y="6.3022286 : 4351.6722 : 0"
       inkscape:vp_z="1429.8059 : 955.01787 : 1"
       inkscape:persp3d-origin="941.45358 : 605.25892 : 1"
       id="perspective1516" />
    <marker
       inkscape:isstock="true"
       style="overflow:visible"
       id="marker1328"
       refX="0"
       refY="0"
       orient="auto"
       inkscape:stockid="Arrow1Lstart">
      <path
         transform="matrix(0.8,0,0,0.8,10,0)"
         style="fill:#000000;fill-opacity:1;fill-rule:evenodd;stroke:#000000;stroke-width:1pt;stroke-opacity:1"
         d="M 0,0 5,-5 -12.5,0 5,5 Z"
         id="path1326" />
    </marker>
    <inkscape:perspective
       sodipodi:type="inkscape:persp3d"
       inkscape:vp_x="117.81869 : 145.4978 : 1"
       inkscape:vp_y="45.041919 : 1512.1241 : 0"
       inkscape:vp_z="269.26419 : 230.46636 : 1"
       inkscape:persp3d-origin="191.31187 : 113.13196 : 1"
       id="perspective1216" />
    <marker
       inkscape:isstock="true"
       style="overflow:visible"
       id="marker988"
       refX="0"
       refY="0"
       orient="auto"
       inkscape:stockid="Arrow1Lstart">
      <path
         transform="matrix(0.8,0,0,0.8,10,0)"
         style="fill:#000000;fill-opacity:1;fill-rule:evenodd;stroke:#000000;stroke-width:1pt;stroke-opacity:1"
         d="M 0,0 5,-5 -12.5,0 5,5 Z"
         id="path986" />
    </marker>
    <marker
       inkscape:stockid="Arrow1Lend"
       orient="auto"
       refY="0"
       refX="0"
       id="marker1855"
       style="overflow:visible"
       inkscape:isstock="true">
      <path
         id="path1853"
         d="M 0,0 5,-5 -12.5,0 5,5 Z"
         style="fill:#000000;fill-opacity:1;fill-rule:evenodd;stroke:#000000;stroke-width:1pt;stroke-opacity:1"
         transform="matrix(-0.8,0,0,-0.8,-10,0)" />
    </marker>
    <marker
       inkscape:isstock="true"
       style="overflow:visible"
       id="marker1503"
       refX="0"
       refY="0"
       orient="auto"
       inkscape:stockid="Arrow1Lend">
      <path
         transform="matrix(-0.8,0,0,-0.8,-10,0)"
         style="fill:#000000;fill-opacity:1;fill-rule:evenodd;stroke:#000000;stroke-width:1pt;stroke-opacity:1"
         d="M 0,0 5,-5 -12.5,0 5,5 Z"
         id="path1501" />
    </marker>
    <marker
       inkscape:isstock="true"
       style="overflow:visible"
       id="marker1391"
       refX="0"
       refY="0"
       orient="auto"
       inkscape:stockid="Arrow1Lend">
      <path
         transform="matrix(-0.8,0,0,-0.8,-10,0)"
         style="fill:#000000;fill-opacity:1;fill-rule:evenodd;stroke:#000000;stroke-width:1pt;stroke-opacity:1"
         d="M 0,0 5,-5 -12.5,0 5,5 Z"
         id="path1389" />
    </marker>
    <marker
       inkscape:stockid="Arrow1Lend"
       orient="auto"
       refY="0"
       refX="0"
       id="Arrow1Lend"
       style="overflow:visible"
       inkscape:isstock="true">
      <path
         id="path4717"
         d="M 0,0 5,-5 -12.5,0 5,5 Z"
         style="fill:#000000;fill-opacity:1;fill-rule:evenodd;stroke:#000000;stroke-width:1pt;stroke-opacity:1"
         transform="matrix(-0.8,0,0,-0.8,-10,0)" />
    </marker>
    <inkscape:perspective
       sodipodi:type="inkscape:persp3d"
       inkscape:vp_x="125.91934 : 137.15524 : 1"
       inkscape:vp_y="1.43409 : 530.49237 : 0"
       inkscape:vp_z="348.02933 : 169.91152 : 1"
       inkscape:persp3d-origin="236.90337 : 127.27402 : 1"
       id="perspective1216-6" />
    <inkscape:perspective
       sodipodi:type="inkscape:persp3d"
       inkscape:vp_x="80.254935 : 73.314907 : 1"
       inkscape:vp_y="0.39511597 : 298.07349 : 0"
       inkscape:vp_z="141.44998 : 91.720051 : 1"
       inkscape:persp3d-origin="110.8329 : 67.762837 : 1"
       id="perspective1216-3" />
    <inkscape:perspective
       sodipodi:type="inkscape:persp3d"
       inkscape:vp_x="95.747682 : 114.95338 : 1"
       inkscape:vp_y="-45.722198 : 1.873093e-10 : 0"
       inkscape:vp_z="409.01973 : 114.95338 : 1"
       inkscape:persp3d-origin="254.64697 : 114.95338 : 1"
       id="perspective1216-1" />
    <inkscape:perspective
       sodipodi:type="inkscape:persp3d"
       inkscape:vp_x="127.14964 : 185.25881 : 1"
       inkscape:vp_y="1.3923797 : 1672.3493 : 0"
       inkscape:vp_z="342.79959 : 288.52132 : 1"
       inkscape:persp3d-origin="234.90569 : 154.10878 : 1"
       id="perspective1216-7" />
    <inkscape:perspective
       sodipodi:type="inkscape:persp3d"
       inkscape:vp_x="135.91978 : 108.96295 : 1"
       inkscape:vp_y="1.3353741 : 865.4322 : 0"
       inkscape:vp_z="342.74074 : 162.40075 : 1"
       inkscape:persp3d-origin="239.26417 : 92.842961 : 1"
       id="perspective1216-1-6" />
    <marker
       inkscape:stockid="Arrow2Lend"
       orient="auto"
       refY="0"
       refX="0"
       id="Arrow2Lend"
       style="overflow:visible"
       inkscape:isstock="true"
       inkscape:collect="always">
      <path
         id="path932"
         style="fill:#000000;fill-opacity:1;fill-rule:evenodd;stroke:#000000;stroke-width:0.625;stroke-linejoin:round;stroke-opacity:1"
         d="M 8.7185878,4.0337352 -2.2072895,0.01601326 8.7185884,-4.0017078 c -1.7454984,2.3720609 -1.7354408,5.6174519 -6e-7,8.035443 z"
         transform="matrix(-1.1,0,0,-1.1,-1.1,0)" />
    </marker>
    <marker
       inkscape:stockid="Arrow2Lend"
       orient="auto"
       refY="0"
       refX="0"
       id="Arrow2Lend-4"
       style="overflow:visible"
       inkscape:isstock="true"
       inkscape:collect="always">
      <path
         id="path932-8"
         style="fill:#000000;fill-opacity:1;fill-rule:evenodd;stroke:#000000;stroke-width:0.625;stroke-linejoin:round;stroke-opacity:1"
         d="M 8.7185878,4.0337352 -2.2072895,0.01601326 8.7185884,-4.0017078 c -1.7454984,2.3720609 -1.7354408,5.6174519 -6e-7,8.035443 z"
         transform="matrix(-1.1,0,0,-1.1,-1.1,0)" />
    </marker>
    <marker
       inkscape:stockid="Arrow2Lend"
       orient="auto"
       refY="0"
       refX="0"
       id="Arrow2Lend-4-0"
       style="overflow:visible"
       inkscape:isstock="true"
       inkscape:collect="always">
      <path
         id="path932-8-4"
         style="fill:#000000;fill-opacity:1;fill-rule:evenodd;stroke:#000000;stroke-width:0.625;stroke-linejoin:round;stroke-opacity:1"
         d="M 8.7185878,4.0337352 -2.2072895,0.01601326 8.7185884,-4.0017078 c -1.7454984,2.3720609 -1.7354408,5.6174519 -6e-7,8.035443 z"
         transform="matrix(-1.1,0,0,-1.1,-1.1,0)" />
    </marker>
    <marker
       inkscape:stockid="Arrow2Lend"
       orient="auto"
       refY="0"
       refX="0"
       id="Arrow2Lend-4-0-4"
       style="overflow:visible"
       inkscape:isstock="true"
       inkscape:collect="always">
      <path
         id="path932-8-4-4"
         style="fill:#000000;fill-opacity:1;fill-rule:evenodd;stroke:#000000;stroke-width:0.625;stroke-linejoin:round;stroke-opacity:1"
         d="M 8.7185878,4.0337352 -2.2072895,0.01601326 8.7185884,-4.0017078 c -1.7454984,2.3720609 -1.7354408,5.6174519 -6e-7,8.035443 z"
         transform="matrix(-1.1,0,0,-1.1,-1.1,0)" />
    </marker>
    <marker
       inkscape:stockid="Arrow2Lend"
       orient="auto"
       refY="0"
       refX="0"
       id="Arrow2Lend-4-0-4-6"
       style="overflow:visible"
       inkscape:isstock="true"
       inkscape:collect="always">
      <path
         id="path932-8-4-4-3"
         style="fill:#000000;fill-opacity:1;fill-rule:evenodd;stroke:#000000;stroke-width:0.625;stroke-linejoin:round;stroke-opacity:1"
         d="M 8.7185878,4.0337352 -2.2072895,0.01601326 8.7185884,-4.0017078 c -1.7454984,2.3720609 -1.7354408,5.6174519 -6e-7,8.035443 z"
         transform="matrix(-1.1,0,0,-1.1,-1.1,0)" />
    </marker>
  </defs>
  <sodipodi:namedview
     id="base"
     pagecolor="#ffffff"
     bordercolor="#666666"
     borderopacity="1.0"
     inkscape:pageopacity="0.0"
     inkscape:pageshadow="2"
     inkscape:zoom="0.70710678"
     inkscape:cx="481.74015"
     inkscape:cy="671.2219"
     inkscape:document-units="mm"
     inkscape:current-layer="layer1"
     showgrid="false"
     inkscape:window-width="2933"
     inkscape:window-height="1719"
     inkscape:window-x="26"
     inkscape:window-y="23"
     inkscape:window-maximized="0"
     inkscape:snap-bbox="true"
     inkscape:snap-global="true"
     inkscape:lockguides="false"
     inkscape:object-paths="true"
     inkscape:object-nodes="true"
     inkscape:bbox-paths="true"
     inkscape:document-rotation="0" />
  <metadata
     id="metadata5">
    <rdf:RDF>
      <cc:Work
         rdf:about="">
        <dc:format>image/svg+xml</dc:format>
        <dc:type
           rdf:resource="http://purl.org/dc/dcmitype/StillImage" />
        <dc:title></dc:title>
      </cc:Work>
    </rdf:RDF>
  </metadata>
  <g
     inkscape:label="Layer 1"
     inkscape:groupmode="layer"
     id="layer1">
    <g
       id="g1933"
       transform="translate(-81.758268,-38.506386)">
      <rect
         ry="1.5435098"
         y="-271.67261"
         x="93.487816"
         height="65.313622"
         width="75.215759"
         id="rect6571-2"
         style="display:inline;opacity:1;vector-effect:none;fill:#ffffff;fill-opacity:1;stroke:#552462;stroke-width:0.875;stroke-linecap:butt;stroke-linejoin:miter;stroke-miterlimit:4;stroke-dasharray:none;stroke-dashoffset:0;stroke-opacity:1"
         transform="scale(1,-1)" />
      <text
         xml:space="preserve"
         style="font-style:normal;font-variant:normal;font-weight:normal;font-stretch:normal;font-size:4.93889px;line-height:1.25;font-family:sans-serif;-inkscape-font-specification:'sans-serif, Normal';font-variant-ligatures:normal;font-variant-caps:normal;font-variant-numeric:normal;font-variant-east-asian:normal;letter-spacing:0px;word-spacing:0px;fill:#000000;fill-opacity:1;stroke:none;stroke-width:0.132291"
         x="108.76683"
         y="213.92616"
         id="text1142"><tspan
           sodipodi:role="line"
           id="tspan1140"
           x="108.76683"
           y="213.92616"
           style="font-style:normal;font-variant:normal;font-weight:normal;font-stretch:normal;font-size:6.35px;font-family:sans-serif;-inkscape-font-specification:'sans-serif, Normal';font-variant-ligatures:normal;font-variant-caps:normal;font-variant-numeric:normal;font-variant-east-asian:normal;stroke-width:0.132291">CI/CD Pipeline</tspan></text>
      <rect
         ry="1.1344475"
         y="-266.09366"
         x="98.251991"
         height="48.004147"
         width="65.687408"
         id="rect6571-2-1"
         style="display:inline;opacity:1;vector-effect:none;fill:#ffffff;fill-opacity:1;stroke:#552462;stroke-width:0.875;stroke-linecap:butt;stroke-linejoin:miter;stroke-miterlimit:4;stroke-dasharray:none;stroke-dashoffset:0;stroke-opacity:1"
         transform="scale(1,-1)" />
      <text
         xml:space="preserve"
         style="font-style:normal;font-variant:normal;font-weight:normal;font-stretch:normal;font-size:4.80916px;line-height:1.25;font-family:sans-serif;-inkscape-font-specification:'sans-serif, Normal';font-variant-ligatures:normal;font-variant-caps:normal;font-variant-numeric:normal;font-variant-east-asian:normal;letter-spacing:0px;word-spacing:0px;fill:#000000;fill-opacity:1;stroke:none;stroke-width:0.128816"
         x="105.74962"
         y="231.34146"
         id="text1142-5"
         transform="scale(1.0269778,0.97373088)"><tspan
           sodipodi:role="line"
           id="tspan1140-9"
           x="105.74962"
           y="231.34146"
           style="font-style:normal;font-variant:normal;font-weight:normal;font-stretch:normal;font-size:6.18319px;font-family:sans-serif;-inkscape-font-specification:'sans-serif, Normal';font-variant-ligatures:normal;font-variant-caps:normal;font-variant-numeric:normal;font-variant-east-asian:normal;stroke-width:0.128816">Image Builder</tspan></text>
      <circle
         style="fill:#ffffff;stroke:#552462;stroke-width:0.980166;stroke-miterlimit:4;stroke-dasharray:none;stroke-opacity:1"
         id="path1646-7"
         cx="146.4391"
         cy="248.49416"
         r="13.828963" />
      <text
         xml:space="preserve"
         style="font-style:normal;font-variant:normal;font-weight:normal;font-stretch:normal;font-size:4.80917px;line-height:1.25;font-family:sans-serif;-inkscape-font-specification:'sans-serif, Normal';font-variant-ligatures:normal;font-variant-caps:normal;font-variant-numeric:normal;font-variant-east-asian:normal;text-align:center;letter-spacing:0px;word-spacing:0px;text-anchor:middle;fill:#000000;fill-opacity:1;stroke:none;stroke-width:0.129;stroke-miterlimit:4;stroke-dasharray:none"
         x="142.58961"
         y="252.44409"
         id="text1142-5-3-5"
         transform="scale(1.0269778,0.97373088)"><tspan
           sodipodi:role="line"
           id="tspan1140-9-6-6"
           x="142.58961"
           y="252.44409"
           style="font-style:normal;font-variant:normal;font-weight:normal;font-stretch:normal;font-size:4.93889px;font-family:sans-serif;-inkscape-font-specification:'sans-serif, Normal';font-variant-ligatures:normal;font-variant-caps:normal;font-variant-numeric:normal;font-variant-east-asian:normal;text-align:center;text-anchor:middle;stroke-width:0.129;stroke-miterlimit:4;stroke-dasharray:none">Generate</tspan><tspan
           sodipodi:role="line"
           x="142.58961"
           y="258.61771"
           style="font-style:normal;font-variant:normal;font-weight:normal;font-stretch:normal;font-size:4.93889px;font-family:sans-serif;-inkscape-font-specification:'sans-serif, Normal';font-variant-ligatures:normal;font-variant-caps:normal;font-variant-numeric:normal;font-variant-east-asian:normal;text-align:center;text-anchor:middle;stroke-width:0.129;stroke-miterlimit:4;stroke-dasharray:none"
           id="tspan1853-3">OSTree</tspan><tspan
           sodipodi:role="line"
           x="142.58961"
           y="264.79132"
           style="font-style:normal;font-variant:normal;font-weight:normal;font-stretch:normal;font-size:4.93889px;font-family:sans-serif;-inkscape-font-specification:'sans-serif, Normal';font-variant-ligatures:normal;font-variant-caps:normal;font-variant-numeric:normal;font-variant-east-asian:normal;text-align:center;text-anchor:middle;stroke-width:0.129;stroke-miterlimit:4;stroke-dasharray:none"
           id="tspan1880">files</tspan></text>
      <circle
         style="fill:#ffffff;stroke:#552462;stroke-width:0.980165;stroke-miterlimit:4;stroke-dasharray:none;stroke-opacity:1"
         id="path1646-7-9"
         cx="115.62312"
         cy="248.70813"
         r="13.828963" />
      <text
         xml:space="preserve"
         style="font-style:normal;font-variant:normal;font-weight:normal;font-stretch:normal;font-size:4.80917px;line-height:1.25;font-family:sans-serif;-inkscape-font-specification:'sans-serif, Normal';font-variant-ligatures:normal;font-variant-caps:normal;font-variant-numeric:normal;font-variant-east-asian:normal;text-align:center;letter-spacing:0px;word-spacing:0px;text-anchor:middle;fill:#000000;fill-opacity:1;stroke:none;stroke-width:0.129;stroke-miterlimit:4;stroke-dasharray:none"
         x="112.98999"
         y="254.10123"
         id="text1142-5-3"
         transform="scale(1.0269778,0.97373088)"><tspan
           sodipodi:role="line"
           id="tspan1140-9-6"
           x="112.98999"
           y="254.10123"
           style="font-style:normal;font-variant:normal;font-weight:normal;font-stretch:normal;font-size:4.9389px;font-family:sans-serif;-inkscape-font-specification:'sans-serif, Normal';font-variant-ligatures:normal;font-variant-caps:normal;font-variant-numeric:normal;font-variant-east-asian:normal;text-align:center;text-anchor:middle;stroke-width:0.129;stroke-miterlimit:4;stroke-dasharray:none">Build</tspan><tspan
           sodipodi:role="line"
           x="112.98999"
           y="260.27484"
           style="font-style:normal;font-variant:normal;font-weight:normal;font-stretch:normal;font-size:4.9389px;font-family:sans-serif;-inkscape-font-specification:'sans-serif, Normal';font-variant-ligatures:normal;font-variant-caps:normal;font-variant-numeric:normal;font-variant-east-asian:normal;text-align:center;text-anchor:middle;stroke-width:0.129;stroke-miterlimit:4;stroke-dasharray:none"
           id="tspan1853">Image</tspan></text>
    </g>
    <text
       xml:space="preserve"
       style="font-style:normal;font-variant:normal;font-weight:normal;font-stretch:normal;font-size:4.93889px;line-height:1.25;font-family:sans-serif;-inkscape-font-specification:'sans-serif, Normal';font-variant-ligatures:normal;font-variant-caps:normal;font-variant-numeric:normal;font-variant-east-asian:normal;letter-spacing:0px;word-spacing:0px;fill:#000000;fill-opacity:1;stroke:none;stroke-width:0.264583"
       x="153.19374"
       y="79.247917"
       id="text3718" />
    <text
       xml:space="preserve"
       style="font-style:normal;font-variant:normal;font-weight:normal;font-stretch:normal;font-size:4.93889px;line-height:1.25;font-family:sans-serif;-inkscape-font-specification:'sans-serif, Normal';font-variant-ligatures:normal;font-variant-caps:normal;font-variant-numeric:normal;font-variant-east-asian:normal;letter-spacing:0px;word-spacing:0px;fill:#000000;fill-opacity:1;stroke:none;stroke-width:0.264583"
       x="148.16667"
       y="75.543747"
       id="text3722" />
    <g
       inkscape:transform-center-y="-4.088062"
       inkscape:transform-center-x="-5.5231174"
       inkscape:corner7="1.4524268 : -0.058600993 : 0.25 : 1"
       inkscape:corner0="1.7634191 : -0.023494798 : 0 : 1"
       inkscape:perspectiveID="#perspective1516"
       style="fill:#a02c2c;stroke-width:1.00157;stroke-miterlimit:4;stroke-dasharray:none"
       id="g1514"
       sodipodi:type="inkscape:box3d">
      <path
         points="630.08603,-324.702 696.43259,-357.08348 696.50601,-407.78026 630.16609,-379.9852 "
         d="m 630.16609,-379.9852 -0.0801,55.2832 66.34656,-32.38148 0.0734,-50.69678 z"
         inkscape:box3dsidetype="6"
         style="fill:#353564;fill-rule:evenodd;stroke:none;stroke-width:2.26493;stroke-linejoin:round"
         id="path1502"
         sodipodi:type="inkscape:box3dside" />
      <path
         points="652.45037,-309.2802 724.3631,-346.81477 696.43259,-357.08348 630.08603,-324.702 "
         d="m 630.08603,-324.702 22.36434,15.4218 71.91273,-37.53457 -27.93051,-10.26871 z"
         inkscape:box3dsidetype="13"
         style="fill:#afafde;fill-rule:evenodd;stroke:none;stroke-width:2.26493;stroke-linejoin:round"
         id="path1504"
         sodipodi:type="inkscape:box3dside" />
      <path
         points="724.44497,-403.34568 724.3631,-346.81477 696.43259,-357.08348 696.50601,-407.78026 "
         d="m 696.50601,-407.78026 27.93896,4.43458 -0.0819,56.53091 -27.93051,-10.26871 z"
         inkscape:box3dsidetype="11"
         style="fill:#e9e9ff;fill-rule:evenodd;stroke:none;stroke-width:2.26493;stroke-linejoin:round"
         id="path1506"
         sodipodi:type="inkscape:box3dside" />
      <path
         points="652.54058,-371.57387 724.44497,-403.34568 696.50601,-407.78026 630.16609,-379.9852 "
         d="m 630.16609,-379.9852 22.37449,8.41133 71.90439,-31.77181 -27.93896,-4.43458 z"
         inkscape:box3dsidetype="5"
         style="fill:#4d4d9f;fill-rule:evenodd;stroke:none;stroke-width:2.26493;stroke-linejoin:round"
         id="path1508"
         sodipodi:type="inkscape:box3dside" />
      <path
         points="652.45037,-309.2802 724.3631,-346.81477 724.44497,-403.34568 652.54058,-371.57387 "
         d="m 652.54058,-371.57387 -0.0902,62.29367 71.91273,-37.53457 0.0819,-56.53091 z"
         inkscape:box3dsidetype="14"
         style="fill:#d7d7ff;fill-rule:evenodd;stroke:none;stroke-width:2.26493;stroke-linejoin:round"
         id="path1510"
         sodipodi:type="inkscape:box3dside" />
      <path
         points="652.54058,-371.57387 652.45037,-309.2802 630.08603,-324.702 630.16609,-379.9852 "
         d="m 630.16609,-379.9852 22.37449,8.41133 -0.0902,62.29367 -22.36434,-15.4218 z"
         inkscape:box3dsidetype="3"
         style="fill:#8686bf;fill-rule:evenodd;stroke:none;stroke-width:2.26493;stroke-linejoin:round"
         id="path1512"
         sodipodi:type="inkscape:box3dside" />
    </g>
    <g
       inkscape:transform-center-y="-4.088062"
       inkscape:transform-center-x="-5.5231174"
       inkscape:corner7="1.4524268 : -0.058600993 : 0.25 : 1"
       inkscape:corner0="1.7634191 : -0.023494798 : 0 : 1"
       inkscape:perspectiveID="#perspective1532"
       style="fill:#a02c2c;stroke-width:1.00157;stroke-miterlimit:4;stroke-dasharray:none"
       id="g1530"
       sodipodi:type="inkscape:box3d">
      <path
         points="589.45937,-307.22912 655.80593,-339.6106 655.87935,-390.30738 589.53944,-362.51232 "
         d="m 589.53944,-362.51232 -0.0801,55.2832 66.34656,-32.38148 0.0734,-50.69678 z"
         inkscape:box3dsidetype="6"
         style="fill:#353564;fill-rule:evenodd;stroke:none;stroke-width:2.26493;stroke-linejoin:round"
         id="path1518"
         sodipodi:type="inkscape:box3dside" />
      <path
         points="611.82371,-291.80732 683.73645,-329.34189 655.80593,-339.6106 589.45937,-307.22912 "
         d="m 589.45937,-307.22912 22.36434,15.4218 71.91274,-37.53457 -27.93052,-10.26871 z"
         inkscape:box3dsidetype="13"
         style="fill:#afafde;fill-rule:evenodd;stroke:none;stroke-width:2.26493;stroke-linejoin:round"
         id="path1520"
         sodipodi:type="inkscape:box3dside" />
      <path
         points="683.81832,-385.8728 683.73645,-329.34189 655.80593,-339.6106 655.87935,-390.30738 "
         d="m 655.87935,-390.30738 27.93897,4.43458 -0.0819,56.53091 -27.93052,-10.26871 z"
         inkscape:box3dsidetype="11"
         style="fill:#e9e9ff;fill-rule:evenodd;stroke:none;stroke-width:2.26493;stroke-linejoin:round"
         id="path1522"
         sodipodi:type="inkscape:box3dside" />
      <path
         points="611.91393,-354.10099 683.81832,-385.8728 655.87935,-390.30738 589.53944,-362.51232 "
         d="m 589.53944,-362.51232 22.37449,8.41133 71.90439,-31.77181 -27.93897,-4.43458 z"
         inkscape:box3dsidetype="5"
         style="fill:#4d4d9f;fill-rule:evenodd;stroke:none;stroke-width:2.26493;stroke-linejoin:round"
         id="path1524"
         sodipodi:type="inkscape:box3dside" />
      <path
         points="611.82371,-291.80732 683.73645,-329.34189 683.81832,-385.8728 611.91393,-354.10099 "
         d="m 611.91393,-354.10099 -0.0902,62.29367 71.91274,-37.53457 0.0819,-56.53091 z"
         inkscape:box3dsidetype="14"
         style="fill:#d7d7ff;fill-rule:evenodd;stroke:none;stroke-width:2.26493;stroke-linejoin:round"
         id="path1526"
         sodipodi:type="inkscape:box3dside" />
      <path
         points="611.91393,-354.10099 611.82371,-291.80732 589.45937,-307.22912 589.53944,-362.51232 "
         d="m 589.53944,-362.51232 22.37449,8.41133 -0.0902,62.29367 -22.36434,-15.4218 z"
         inkscape:box3dsidetype="3"
         style="fill:#8686bf;fill-rule:evenodd;stroke:none;stroke-width:2.26493;stroke-linejoin:round"
         id="path1528"
         sodipodi:type="inkscape:box3dside" />
    </g>
    <g
       inkscape:transform-center-y="-4.088062"
       inkscape:transform-center-x="-5.5231174"
       inkscape:corner7="1.4524268 : -0.058600993 : 0.25 : 1"
       inkscape:corner0="1.7634191 : -0.023494798 : 0 : 1"
       inkscape:perspectiveID="#perspective1548"
       style="fill:#a02c2c;stroke-width:1.00157;stroke-miterlimit:4;stroke-dasharray:none"
       id="g1546"
       sodipodi:type="inkscape:box3d">
      <path
         points="636.0666,-320.33433 702.41316,-352.71581 702.48658,-403.4126 636.14666,-375.61753 "
         d="m 636.14666,-375.61753 -0.0801,55.2832 66.34656,-32.38148 0.0734,-50.69679 z"
         inkscape:box3dsidetype="6"
         style="fill:#353564;fill-rule:evenodd;stroke:none;stroke-width:2.26493;stroke-linejoin:round"
         id="path1534"
         sodipodi:type="inkscape:box3dside" />
      <path
         points="658.43094,-304.91253 730.34367,-342.4471 702.41316,-352.71581 636.0666,-320.33433 "
         d="m 636.0666,-320.33433 22.36434,15.4218 71.91273,-37.53457 -27.93051,-10.26871 z"
         inkscape:box3dsidetype="13"
         style="fill:#afafde;fill-rule:evenodd;stroke:none;stroke-width:2.26493;stroke-linejoin:round"
         id="path1536"
         sodipodi:type="inkscape:box3dside" />
      <path
         points="730.42554,-398.97801 730.34367,-342.4471 702.41316,-352.71581 702.48658,-403.4126 "
         d="m 702.48658,-403.4126 27.93896,4.43459 -0.0819,56.53091 -27.93051,-10.26871 z"
         inkscape:box3dsidetype="11"
         style="fill:#e9e9ff;fill-rule:evenodd;stroke:none;stroke-width:2.26493;stroke-linejoin:round"
         id="path1538"
         sodipodi:type="inkscape:box3dside" />
      <path
         points="658.52115,-367.2062 730.42554,-398.97801 702.48658,-403.4126 636.14666,-375.61753 "
         d="m 636.14666,-375.61753 22.37449,8.41133 71.90439,-31.77181 -27.93896,-4.43459 z"
         inkscape:box3dsidetype="5"
         style="fill:#4d4d9f;fill-rule:evenodd;stroke:none;stroke-width:2.26493;stroke-linejoin:round"
         id="path1540"
         sodipodi:type="inkscape:box3dside" />
      <path
         points="658.43094,-304.91253 730.34367,-342.4471 730.42554,-398.97801 658.52115,-367.2062 "
         d="m 658.52115,-367.2062 -0.0902,62.29367 71.91273,-37.53457 0.0819,-56.53091 z"
         inkscape:box3dsidetype="14"
         style="fill:#d7d7ff;fill-rule:evenodd;stroke:none;stroke-width:2.26493;stroke-linejoin:round"
         id="path1542"
         sodipodi:type="inkscape:box3dside" />
      <path
         points="658.52115,-367.2062 658.43094,-304.91253 636.0666,-320.33433 636.14666,-375.61753 "
         d="m 636.14666,-375.61753 22.37449,8.41133 -0.0902,62.29367 -22.36434,-15.4218 z"
         inkscape:box3dsidetype="3"
         style="fill:#8686bf;fill-rule:evenodd;stroke:none;stroke-width:2.26493;stroke-linejoin:round"
         id="path1544"
         sodipodi:type="inkscape:box3dside" />
    </g>
    <g
       sodipodi:type="inkscape:box3d"
       id="g1562"
       style="fill:#a02c2c;stroke-width:1.00157;stroke-miterlimit:4;stroke-dasharray:none"
       inkscape:perspectiveID="#perspective1548"
       inkscape:corner0="1.7634191 : -0.023494798 : 0 : 1"
       inkscape:corner7="1.4524268 : -0.058600993 : 0.25 : 1"
       inkscape:transform-center-x="-5.5231174"
       inkscape:transform-center-y="-4.088062">
      <path
         sodipodi:type="inkscape:box3dside"
         id="path1550"
         style="fill:#353564;fill-rule:evenodd;stroke:none;stroke-width:2.26493;stroke-linejoin:round"
         inkscape:box3dsidetype="6"
         d="m 636.14666,-375.61753 -0.0801,55.2832 66.34656,-32.38148 0.0734,-50.69679 z"
         points="636.0666,-320.33433 702.41316,-352.71581 702.48658,-403.4126 636.14666,-375.61753 " />
      <path
         sodipodi:type="inkscape:box3dside"
         id="path1552"
         style="fill:#afafde;fill-rule:evenodd;stroke:none;stroke-width:2.26493;stroke-linejoin:round"
         inkscape:box3dsidetype="13"
         d="m 636.0666,-320.33433 22.36434,15.4218 71.91273,-37.53457 -27.93051,-10.26871 z"
         points="658.43094,-304.91253 730.34367,-342.4471 702.41316,-352.71581 636.0666,-320.33433 " />
      <path
         sodipodi:type="inkscape:box3dside"
         id="path1554"
         style="fill:#e9e9ff;fill-rule:evenodd;stroke:none;stroke-width:2.26493;stroke-linejoin:round"
         inkscape:box3dsidetype="11"
         d="m 702.48658,-403.4126 27.93896,4.43459 -0.0819,56.53091 -27.93051,-10.26871 z"
         points="730.42554,-398.97801 730.34367,-342.4471 702.41316,-352.71581 702.48658,-403.4126 " />
      <path
         sodipodi:type="inkscape:box3dside"
         id="path1556"
         style="fill:#4d4d9f;fill-rule:evenodd;stroke:none;stroke-width:2.26493;stroke-linejoin:round"
         inkscape:box3dsidetype="5"
         d="m 636.14666,-375.61753 22.37449,8.41133 71.90439,-31.77181 -27.93896,-4.43459 z"
         points="658.52115,-367.2062 730.42554,-398.97801 702.48658,-403.4126 636.14666,-375.61753 " />
      <path
         sodipodi:type="inkscape:box3dside"
         id="path1558"
         style="fill:#d7d7ff;fill-rule:evenodd;stroke:none;stroke-width:2.26493;stroke-linejoin:round"
         inkscape:box3dsidetype="14"
         d="m 658.52115,-367.2062 -0.0902,62.29367 71.91273,-37.53457 0.0819,-56.53091 z"
         points="658.43094,-304.91253 730.34367,-342.4471 730.42554,-398.97801 658.52115,-367.2062 " />
      <path
         sodipodi:type="inkscape:box3dside"
         id="path1560"
         style="fill:#8686bf;fill-rule:evenodd;stroke:none;stroke-width:2.26493;stroke-linejoin:round"
         inkscape:box3dsidetype="3"
         d="m 636.14666,-375.61753 22.37449,8.41133 -0.0902,62.29367 -22.36434,-15.4218 z"
         points="658.52115,-367.2062 658.43094,-304.91253 636.0666,-320.33433 636.14666,-375.61753 " />
    </g>
    <g
       inkscape:transform-center-y="-4.088062"
       inkscape:transform-center-x="-5.5231174"
       inkscape:corner7="1.4524268 : -0.058600993 : 0.25 : 1"
       inkscape:corner0="1.7634191 : -0.023494798 : 0 : 1"
       inkscape:perspectiveID="#perspective1578"
       style="fill:#a02c2c;stroke-width:1.00157;stroke-miterlimit:4;stroke-dasharray:none"
       id="g1576"
       sodipodi:type="inkscape:box3d">
      <path
         points="624.08319,-338.59266 690.42974,-370.97414 690.50316,-421.67092 624.16325,-393.87586 "
         d="m 624.16325,-393.87586 -0.0801,55.2832 66.34655,-32.38148 0.0734,-50.69678 z"
         inkscape:box3dsidetype="6"
         style="fill:#353564;fill-rule:evenodd;stroke:none;stroke-width:2.26493;stroke-linejoin:round"
         id="path1564"
         sodipodi:type="inkscape:box3dside" />
      <path
         points="646.44753,-323.17086 718.36025,-360.70543 690.42974,-370.97414 624.08319,-338.59266 "
         d="m 624.08319,-338.59266 22.36434,15.4218 71.91272,-37.53457 -27.93051,-10.26871 z"
         inkscape:box3dsidetype="13"
         style="fill:#afafde;fill-rule:evenodd;stroke:none;stroke-width:2.26493;stroke-linejoin:round"
         id="path1566"
         sodipodi:type="inkscape:box3dside" />
      <path
         points="718.44212,-417.23634 718.36025,-360.70543 690.42974,-370.97414 690.50316,-421.67092 "
         d="m 690.50316,-421.67092 27.93896,4.43458 -0.0819,56.53091 -27.93051,-10.26871 z"
         inkscape:box3dsidetype="11"
         style="fill:#e9e9ff;fill-rule:evenodd;stroke:none;stroke-width:2.26493;stroke-linejoin:round"
         id="path1568"
         sodipodi:type="inkscape:box3dside" />
      <path
         points="646.53774,-385.46452 718.44212,-417.23634 690.50316,-421.67092 624.16325,-393.87586 "
         d="m 624.16325,-393.87586 22.37449,8.41134 71.90438,-31.77182 -27.93896,-4.43458 z"
         inkscape:box3dsidetype="5"
         style="fill:#4d4d9f;fill-rule:evenodd;stroke:none;stroke-width:2.26493;stroke-linejoin:round"
         id="path1570"
         sodipodi:type="inkscape:box3dside" />
      <path
         points="646.44753,-323.17086 718.36025,-360.70543 718.44212,-417.23634 646.53774,-385.46452 "
         d="m 646.53774,-385.46452 -0.0902,62.29366 71.91272,-37.53457 0.0819,-56.53091 z"
         inkscape:box3dsidetype="14"
         style="fill:#d7d7ff;fill-rule:evenodd;stroke:none;stroke-width:2.26493;stroke-linejoin:round"
         id="path1572"
         sodipodi:type="inkscape:box3dside" />
      <path
         points="646.53774,-385.46452 646.44753,-323.17086 624.08319,-338.59266 624.16325,-393.87586 "
         d="m 624.16325,-393.87586 22.37449,8.41134 -0.0902,62.29366 -22.36434,-15.4218 z"
         inkscape:box3dsidetype="3"
         style="fill:#8686bf;fill-rule:evenodd;stroke:none;stroke-width:2.26493;stroke-linejoin:round"
         id="path1574"
         sodipodi:type="inkscape:box3dside" />
    </g>
    <g
       inkscape:transform-center-y="-4.088062"
       inkscape:transform-center-x="-5.5231174"
       inkscape:corner7="1.4524268 : -0.058600993 : 0.25 : 1"
       inkscape:corner0="1.7634191 : -0.023494798 : 0 : 1"
       inkscape:perspectiveID="#perspective1612"
       style="fill:#a02c2c;stroke-width:1.00157;stroke-miterlimit:4;stroke-dasharray:none"
       id="g1610"
       sodipodi:type="inkscape:box3d">
      <path
         points="641.80887,-433.69994 708.15542,-466.08141 708.22884,-516.7782 641.88894,-488.98314 "
         d="m 641.88894,-488.98314 -0.0801,55.2832 66.34655,-32.38147 0.0734,-50.69679 z"
         inkscape:box3dsidetype="6"
         style="fill:#353564;fill-rule:evenodd;stroke:none;stroke-width:2.26493;stroke-linejoin:round"
         id="path1598"
         sodipodi:type="inkscape:box3dside" />
      <path
         points="664.17321,-418.27814 736.08593,-455.8127 708.15542,-466.08141 641.80887,-433.69994 "
         d="m 641.80887,-433.69994 22.36434,15.4218 71.91272,-37.53456 -27.93051,-10.26871 z"
         inkscape:box3dsidetype="13"
         style="fill:#afafde;fill-rule:evenodd;stroke:none;stroke-width:2.26493;stroke-linejoin:round"
         id="path1600"
         sodipodi:type="inkscape:box3dside" />
      <path
         points="736.1678,-512.34361 736.08593,-455.8127 708.15542,-466.08141 708.22884,-516.7782 "
         d="m 708.22884,-516.7782 27.93896,4.43459 -0.0819,56.53091 -27.93051,-10.26871 z"
         inkscape:box3dsidetype="11"
         style="fill:#e9e9ff;fill-rule:evenodd;stroke:none;stroke-width:2.26493;stroke-linejoin:round"
         id="path1602"
         sodipodi:type="inkscape:box3dside" />
      <path
         points="664.26342,-480.5718 736.1678,-512.34361 708.22884,-516.7782 641.88894,-488.98314 "
         d="m 641.88894,-488.98314 22.37448,8.41134 71.90438,-31.77181 -27.93896,-4.43459 z"
         inkscape:box3dsidetype="5"
         style="fill:#4d4d9f;fill-rule:evenodd;stroke:none;stroke-width:2.26493;stroke-linejoin:round"
         id="path1604"
         sodipodi:type="inkscape:box3dside" />
      <path
         points="664.17321,-418.27814 736.08593,-455.8127 736.1678,-512.34361 664.26342,-480.5718 "
         d="m 664.26342,-480.5718 -0.0902,62.29366 71.91272,-37.53456 0.0819,-56.53091 z"
         inkscape:box3dsidetype="14"
         style="fill:#d7d7ff;fill-rule:evenodd;stroke:none;stroke-width:2.26493;stroke-linejoin:round"
         id="path1606"
         sodipodi:type="inkscape:box3dside" />
      <path
         points="664.26342,-480.5718 664.17321,-418.27814 641.80887,-433.69994 641.88894,-488.98314 "
         d="m 641.88894,-488.98314 22.37448,8.41134 -0.0902,62.29366 -22.36434,-15.4218 z"
         inkscape:box3dsidetype="3"
         style="fill:#8686bf;fill-rule:evenodd;stroke:none;stroke-width:2.26493;stroke-linejoin:round"
         id="path1608"
         sodipodi:type="inkscape:box3dside" />
    </g>
    <g
       inkscape:transform-center-y="-5.9378033"
       inkscape:transform-center-x="-4.6119724"
       inkscape:corner7="1.4524268 : -0.058600993 : 0.25 : 1"
       inkscape:corner0="1.7634191 : -0.023494798 : 0 : 1"
       inkscape:perspectiveID="#perspective1657"
       style="fill:#a02c2c;stroke-width:1.00157;stroke-miterlimit:4;stroke-dasharray:none"
       id="g1653"
       sodipodi:type="inkscape:box3d">
      <path
         points="637.41737,-387.17737 692.81861,-434.21064 692.87991,-507.84639 637.48423,-467.47477 "
         d="m 637.48423,-467.47477 -0.0669,80.2974 55.40124,-47.03327 0.0613,-73.63575 z"
         inkscape:box3dsidetype="6"
         style="fill:#353564;fill-rule:evenodd;stroke:none;stroke-width:2.49437;stroke-linejoin:round"
         id="path1641"
         sodipodi:type="inkscape:box3dside" />
      <path
         points="656.09222,-364.77761 716.14137,-419.29561 692.81861,-434.21064 637.41737,-387.17737 "
         d="m 637.41737,-387.17737 18.67485,22.39976 60.04915,-54.518 -23.32276,-14.91503 z"
         inkscape:box3dsidetype="13"
         style="fill:#afafde;fill-rule:evenodd;stroke:none;stroke-width:2.49437;stroke-linejoin:round"
         id="path1643"
         sodipodi:type="inkscape:box3dside" />
      <path
         points="716.20973,-501.40528 716.14137,-419.29561 692.81861,-434.21064 692.87991,-507.84639 "
         d="m 692.87991,-507.84639 23.32982,6.44111 -0.0684,82.10967 -23.32276,-14.91503 z"
         inkscape:box3dsidetype="11"
         style="fill:#e9e9ff;fill-rule:evenodd;stroke:none;stroke-width:2.49437;stroke-linejoin:round"
         id="path1645"
         sodipodi:type="inkscape:box3dside" />
      <path
         points="656.16755,-455.25753 716.20973,-501.40528 692.87991,-507.84639 637.48423,-467.47477 "
         d="m 637.48423,-467.47477 18.68332,12.21724 60.04218,-46.14775 -23.32982,-6.44111 z"
         inkscape:box3dsidetype="5"
         style="fill:#4d4d9f;fill-rule:evenodd;stroke:none;stroke-width:2.49437;stroke-linejoin:round"
         id="path1647"
         sodipodi:type="inkscape:box3dside" />
      <path
         points="656.09222,-364.77761 716.14137,-419.29561 716.20973,-501.40528 656.16755,-455.25753 "
         d="m 656.16755,-455.25753 -0.0753,90.47992 60.04915,-54.518 0.0684,-82.10967 z"
         inkscape:box3dsidetype="14"
         style="fill:#d7d7ff;fill-rule:evenodd;stroke:none;stroke-width:2.49437;stroke-linejoin:round"
         id="path1649"
         sodipodi:type="inkscape:box3dside" />
      <path
         points="656.16755,-455.25753 656.09222,-364.77761 637.41737,-387.17737 637.48423,-467.47477 "
         d="m 637.48423,-467.47477 18.68332,12.21724 -0.0753,90.47992 -18.67485,-22.39976 z"
         inkscape:box3dsidetype="3"
         style="fill:#8686bf;fill-rule:evenodd;stroke:none;stroke-width:2.49437;stroke-linejoin:round"
         id="path1651"
         sodipodi:type="inkscape:box3dside" />
    </g>
    <text
       xml:space="preserve"
       style="font-style:normal;font-variant:normal;font-weight:normal;font-stretch:normal;font-size:4.93889px;line-height:1.25;font-family:sans-serif;-inkscape-font-specification:'sans-serif, Normal';font-variant-ligatures:normal;font-variant-caps:normal;font-variant-numeric:normal;font-variant-east-asian:normal;text-align:center;letter-spacing:0px;word-spacing:0px;text-anchor:middle;fill:#000000;fill-opacity:1;stroke:none;stroke-width:0.264583"
       x="117.20906"
       y="22.6961"
       id="text3702"><tspan
         sodipodi:role="line"
         id="tspan3700"
         x="117.20906"
         y="22.6961"
         style="font-style:normal;font-variant:normal;font-weight:normal;font-stretch:normal;font-size:4.93889px;font-family:sans-serif;-inkscape-font-specification:'sans-serif, Normal';font-variant-ligatures:normal;font-variant-caps:normal;font-variant-numeric:normal;font-variant-east-asian:normal;text-align:center;text-anchor:middle;stroke-width:0.264583">HTTPS</tspan><tspan
         sodipodi:role="line"
         x="117.20906"
         y="28.869713"
         style="font-style:normal;font-variant:normal;font-weight:normal;font-stretch:normal;font-size:4.93889px;font-family:sans-serif;-inkscape-font-specification:'sans-serif, Normal';font-variant-ligatures:normal;font-variant-caps:normal;font-variant-numeric:normal;font-variant-east-asian:normal;text-align:center;text-anchor:middle;stroke-width:0.264583"
         id="tspan2888">Pull OSTree</tspan><tspan
         sodipodi:role="line"
         x="117.20906"
         y="35.043324"
         style="font-style:normal;font-variant:normal;font-weight:normal;font-stretch:normal;font-size:4.93889px;font-family:sans-serif;-inkscape-font-specification:'sans-serif, Normal';font-variant-ligatures:normal;font-variant-caps:normal;font-variant-numeric:normal;font-variant-east-asian:normal;text-align:center;text-anchor:middle;stroke-width:0.264583"
         id="tspan3651">updates</tspan></text>
    <text
       xml:space="preserve"
       style="font-style:normal;font-variant:normal;font-weight:normal;font-stretch:normal;font-size:4.93889px;line-height:1.25;font-family:sans-serif;-inkscape-font-specification:'sans-serif, Normal';font-variant-ligatures:normal;font-variant-caps:normal;font-variant-numeric:normal;font-variant-east-asian:normal;text-align:center;letter-spacing:0px;word-spacing:0px;text-anchor:middle;fill:#000000;fill-opacity:1;stroke:none;stroke-width:0.264583"
       x="64.148712"
       y="150.40227"
       id="text5092"><tspan
         sodipodi:role="line"
         id="tspan5090"
         x="64.148712"
         y="150.40227"
         style="font-style:normal;font-variant:normal;font-weight:normal;font-stretch:normal;font-size:4.93889px;font-family:sans-serif;-inkscape-font-specification:'sans-serif, Normal';font-variant-ligatures:normal;font-variant-caps:normal;font-variant-numeric:normal;font-variant-east-asian:normal;text-align:center;text-anchor:middle;stroke-width:0.264583">SSH Push</tspan><tspan
         sodipodi:role="line"
         x="64.148712"
         y="156.57588"
         style="font-style:normal;font-variant:normal;font-weight:normal;font-stretch:normal;font-size:4.93889px;font-family:sans-serif;-inkscape-font-specification:'sans-serif, Normal';font-variant-ligatures:normal;font-variant-caps:normal;font-variant-numeric:normal;font-variant-east-asian:normal;text-align:center;text-anchor:middle;stroke-width:0.264583"
         id="tspan1947">OSTree</tspan><tspan
         sodipodi:role="line"
         x="64.148712"
         y="162.7495"
         style="font-style:normal;font-variant:normal;font-weight:normal;font-stretch:normal;font-size:4.93889px;font-family:sans-serif;-inkscape-font-specification:'sans-serif, Normal';font-variant-ligatures:normal;font-variant-caps:normal;font-variant-numeric:normal;font-variant-east-asian:normal;text-align:center;text-anchor:middle;stroke-width:0.264583"
         id="tspan1949">Updates</tspan></text>
    <text
       xml:space="preserve"
       style="font-style:normal;font-variant:normal;font-weight:normal;font-stretch:normal;font-size:10.5833px;line-height:1.25;font-family:Karla;-inkscape-font-specification:Karla;letter-spacing:0px;word-spacing:0px;fill:#000000;fill-opacity:1;stroke:none;stroke-width:0.264583"
       x="155.91063"
       y="206.16733"
       id="text1544"><tspan
         sodipodi:role="line"
         x="155.91063"
         y="206.16733"
         style="stroke-width:0.264583"
         id="tspan1550" /></text>
    <g
       id="g1957"
       transform="translate(-105.4397,-57.962569)">
      <rect
         ry="0.73698622"
         y="-189.54041"
         x="117.16927"
         height="31.185574"
         width="75.215759"
         id="rect6571-2-9"
         style="display:inline;opacity:1;vector-effect:none;fill:#ffffff;fill-opacity:1;stroke:#552462;stroke-width:0.875;stroke-linecap:butt;stroke-linejoin:miter;stroke-miterlimit:4;stroke-dasharray:none;stroke-dashoffset:0;stroke-opacity:1"
         transform="scale(1,-1)" />
      <text
         xml:space="preserve"
         style="font-style:normal;font-variant:normal;font-weight:normal;font-stretch:normal;font-size:4.9389px;line-height:1.25;font-family:sans-serif;-inkscape-font-specification:'sans-serif, Normal';font-variant-ligatures:normal;font-variant-caps:normal;font-variant-numeric:normal;font-variant-east-asian:normal;letter-spacing:0px;word-spacing:0px;fill:#000000;fill-opacity:1;stroke:none;stroke-width:0.132291"
         x="125.9045"
         y="165.92201"
         id="text1142-0"><tspan
           sodipodi:role="line"
           id="tspan1140-91"
           x="125.9045"
           y="165.92201"
           style="font-style:normal;font-variant:normal;font-weight:normal;font-stretch:normal;font-size:6.35px;font-family:sans-serif;-inkscape-font-specification:'sans-serif, Normal';font-variant-ligatures:normal;font-variant-caps:normal;font-variant-numeric:normal;font-variant-east-asian:normal;stroke-width:0.132291">Static File Storage</tspan></text>
      <rect
         ry="0.31746274"
         y="-183.5188"
         x="123.08715"
         height="13.433436"
         width="65.687408"
         id="rect6571-2-1-7"
         style="display:inline;opacity:1;vector-effect:none;fill:#ffffff;fill-opacity:1;stroke:#552462;stroke-width:0.875;stroke-linecap:butt;stroke-linejoin:miter;stroke-miterlimit:4;stroke-dasharray:none;stroke-dashoffset:0;stroke-opacity:1"
         transform="scale(1,-1)" />
      <text
         xml:space="preserve"
         style="font-style:normal;font-variant:normal;font-weight:normal;font-stretch:normal;font-size:4.80917px;line-height:1.25;font-family:sans-serif;-inkscape-font-specification:'sans-serif, Normal';font-variant-ligatures:normal;font-variant-caps:normal;font-variant-numeric:normal;font-variant-east-asian:normal;letter-spacing:0px;word-spacing:0px;fill:#000000;fill-opacity:1;stroke:none;stroke-width:0.128816"
         x="123.49411"
         y="183.27762"
         id="text1142-5-7"
         transform="scale(1.0269778,0.97373088)"><tspan
           sodipodi:role="line"
           id="tspan1140-9-1"
           x="123.49411"
           y="183.27762"
           style="font-style:normal;font-variant:normal;font-weight:normal;font-stretch:normal;font-size:6.18318px;font-family:sans-serif;-inkscape-font-specification:'sans-serif, Normal';font-variant-ligatures:normal;font-variant-caps:normal;font-variant-numeric:normal;font-variant-east-asian:normal;stroke-width:0.128816">OSTree Repository</tspan></text>
    </g>
    <g
       id="g2220"
       transform="translate(3.0726808,-46.21877)">
      <rect
         ry="0.73698622"
         y="-122.76678"
         x="1.3568184"
         height="31.185574"
         width="92.827232"
         id="rect6571-2-9-1"
         style="display:inline;opacity:1;vector-effect:none;fill:#ffffff;fill-opacity:1;stroke:#552462;stroke-width:0.875;stroke-linecap:butt;stroke-linejoin:miter;stroke-miterlimit:4;stroke-dasharray:none;stroke-dashoffset:0;stroke-opacity:1"
         transform="scale(1,-1)" />
      <text
         xml:space="preserve"
         style="font-style:normal;font-variant:normal;font-weight:normal;font-stretch:normal;font-size:4.9389px;line-height:1.25;font-family:sans-serif;-inkscape-font-specification:'sans-serif, Normal';font-variant-ligatures:normal;font-variant-caps:normal;font-variant-numeric:normal;font-variant-east-asian:normal;letter-spacing:0px;word-spacing:0px;fill:#000000;fill-opacity:1;stroke:none;stroke-width:0.132291"
         x="4.214952"
         y="99.148384"
         id="text1142-0-5"><tspan
           sodipodi:role="line"
           id="tspan1140-91-9"
           x="4.214952"
           y="99.148384"
           style="font-style:normal;font-variant:normal;font-weight:normal;font-stretch:normal;font-size:6.35px;font-family:sans-serif;-inkscape-font-specification:'sans-serif, Normal';font-variant-ligatures:normal;font-variant-caps:normal;font-variant-numeric:normal;font-variant-east-asian:normal;stroke-width:0.132291">Web Service (CDN Friendly)</tspan></text>
      <rect
         ry="0.31683579"
         y="-116.7319"
         x="6.5085807"
         height="13.406907"
         width="82.523705"
         id="rect6571-2-1-7-7"
         style="display:inline;opacity:1;vector-effect:none;fill:#ffffff;fill-opacity:1;stroke:#552462;stroke-width:0.875;stroke-linecap:butt;stroke-linejoin:miter;stroke-miterlimit:4;stroke-dasharray:none;stroke-dashoffset:0;stroke-opacity:1"
         transform="scale(1,-1)" />
      <text
         xml:space="preserve"
         style="font-style:normal;font-variant:normal;font-weight:normal;font-stretch:normal;font-size:4.80917px;line-height:1.25;font-family:sans-serif;-inkscape-font-specification:'sans-serif, Normal';font-variant-ligatures:normal;font-variant-caps:normal;font-variant-numeric:normal;font-variant-east-asian:normal;letter-spacing:0px;word-spacing:0px;fill:#000000;fill-opacity:1;stroke:none;stroke-width:0.128816"
         x="13.976866"
         y="114.70259"
         id="text1142-5-7-7"
         transform="scale(1.0269778,0.97373088)"><tspan
           sodipodi:role="line"
           id="tspan1140-9-1-6"
           x="13.976866"
           y="114.70259"
           style="font-style:normal;font-variant:normal;font-weight:normal;font-stretch:normal;font-size:6.18318px;font-family:sans-serif;-inkscape-font-specification:'sans-serif, Normal';font-variant-ligatures:normal;font-variant-caps:normal;font-variant-numeric:normal;font-variant-east-asian:normal;stroke-width:0.128816">Client Authentication</tspan></text>
    </g>
    <path
       sodipodi:nodetypes="cc"
       inkscape:connector-curvature="0"
       id="path901"
       d="m 49.088359,167.85236 0.355223,-34.66483"
       style="display:inline;opacity:1;vector-effect:none;fill:none;fill-opacity:1;stroke:#000000;stroke-width:0.834832;stroke-linecap:butt;stroke-linejoin:miter;stroke-miterlimit:4;stroke-dasharray:none;stroke-dashoffset:0;stroke-opacity:1;marker-end:url(#Arrow2Lend)" />
    <path
       sodipodi:nodetypes="cc"
       inkscape:connector-curvature="0"
       id="path901-1"
       d="M 49.089055,100.23553 49.482204,77.796399"
       style="display:inline;opacity:1;vector-effect:none;fill:none;fill-opacity:1;stroke:#000000;stroke-width:0.70662;stroke-linecap:butt;stroke-linejoin:miter;stroke-miterlimit:4;stroke-dasharray:none;stroke-dashoffset:0;stroke-opacity:1;marker-end:url(#Arrow2Lend-4)" />
    <g
       id="g1957-2"
       transform="translate(19.690627,-151.08689)">
      <rect
         ry="0.73822922"
         y="-189.56671"
         x="117.14297"
         height="31.238171"
         width="66.332985"
         id="rect6571-2-9-9"
         style="display:inline;opacity:1;vector-effect:none;fill:#ffffff;fill-opacity:1;stroke:#552462;stroke-width:0.822402;stroke-linecap:butt;stroke-linejoin:miter;stroke-miterlimit:4;stroke-dasharray:none;stroke-dashoffset:0;stroke-opacity:1"
         transform="scale(1,-1)" />
      <text
         xml:space="preserve"
         style="font-style:normal;font-variant:normal;font-weight:normal;font-stretch:normal;font-size:4.9389px;line-height:1.25;font-family:sans-serif;-inkscape-font-specification:'sans-serif, Normal';font-variant-ligatures:normal;font-variant-caps:normal;font-variant-numeric:normal;font-variant-east-asian:normal;letter-spacing:0px;word-spacing:0px;fill:#000000;fill-opacity:1;stroke:none;stroke-width:0.132291"
         x="139.30858"
         y="165.92201"
         id="text1142-0-3"><tspan
           sodipodi:role="line"
           id="tspan1140-91-90"
           x="139.30858"
           y="165.92201"
           style="font-style:normal;font-variant:normal;font-weight:normal;font-stretch:normal;font-size:6.35px;font-family:sans-serif;-inkscape-font-specification:'sans-serif, Normal';font-variant-ligatures:normal;font-variant-caps:normal;font-variant-numeric:normal;font-variant-east-asian:normal;stroke-width:0.132291">Device</tspan></text>
      <rect
         ry="0.31916088"
         y="-183.55473"
         x="122.78583"
         height="13.505293"
         width="55.047256"
         id="rect6571-2-1-7-8"
         style="display:inline;opacity:1;vector-effect:none;fill:#ffffff;fill-opacity:1;stroke:#552462;stroke-width:0.803144;stroke-linecap:butt;stroke-linejoin:miter;stroke-miterlimit:4;stroke-dasharray:none;stroke-dashoffset:0;stroke-opacity:1"
         transform="scale(1,-1)" />
      <text
         xml:space="preserve"
         style="font-style:normal;font-variant:normal;font-weight:normal;font-stretch:normal;font-size:4.80917px;line-height:1.25;font-family:sans-serif;-inkscape-font-specification:'sans-serif, Normal';font-variant-ligatures:normal;font-variant-caps:normal;font-variant-numeric:normal;font-variant-east-asian:normal;letter-spacing:0px;word-spacing:0px;fill:#000000;fill-opacity:1;stroke:none;stroke-width:0.128816"
         x="122.82835"
         y="183.27762"
         id="text1142-5-7-8"
         transform="scale(1.0269778,0.97373088)"><tspan
           sodipodi:role="line"
           id="tspan1140-9-1-5"
           x="122.82835"
           y="183.27762"
           style="font-style:normal;font-variant:normal;font-weight:normal;font-stretch:normal;font-size:6.18318px;font-family:sans-serif;-inkscape-font-specification:'sans-serif, Normal';font-variant-ligatures:normal;font-variant-caps:normal;font-variant-numeric:normal;font-variant-east-asian:normal;stroke-width:0.128816">libostree agent</tspan></text>
    </g>
    <g
       id="g1957-2-6"
       transform="translate(19.690627,-115.08532)">
      <rect
         ry="0.73822922"
         y="-189.56671"
         x="117.14297"
         height="31.238171"
         width="66.332985"
         id="rect6571-2-9-9-3"
         style="display:inline;opacity:1;vector-effect:none;fill:#ffffff;fill-opacity:1;stroke:#552462;stroke-width:0.822402;stroke-linecap:butt;stroke-linejoin:miter;stroke-miterlimit:4;stroke-dasharray:none;stroke-dashoffset:0;stroke-opacity:1"
         transform="scale(1,-1)" />
      <text
         xml:space="preserve"
         style="font-style:normal;font-variant:normal;font-weight:normal;font-stretch:normal;font-size:4.9389px;line-height:1.25;font-family:sans-serif;-inkscape-font-specification:'sans-serif, Normal';font-variant-ligatures:normal;font-variant-caps:normal;font-variant-numeric:normal;font-variant-east-asian:normal;letter-spacing:0px;word-spacing:0px;fill:#000000;fill-opacity:1;stroke:none;stroke-width:0.132291"
         x="139.30858"
         y="165.92201"
         id="text1142-0-3-8"><tspan
           sodipodi:role="line"
           id="tspan1140-91-90-5"
           x="139.30858"
           y="165.92201"
           style="font-style:normal;font-variant:normal;font-weight:normal;font-stretch:normal;font-size:6.35px;font-family:sans-serif;-inkscape-font-specification:'sans-serif, Normal';font-variant-ligatures:normal;font-variant-caps:normal;font-variant-numeric:normal;font-variant-east-asian:normal;stroke-width:0.132291">Device</tspan></text>
      <rect
         ry="0.31916088"
         y="-183.55473"
         x="122.78583"
         height="13.505293"
         width="55.047256"
         id="rect6571-2-1-7-8-6"
         style="display:inline;opacity:1;vector-effect:none;fill:#ffffff;fill-opacity:1;stroke:#552462;stroke-width:0.803144;stroke-linecap:butt;stroke-linejoin:miter;stroke-miterlimit:4;stroke-dasharray:none;stroke-dashoffset:0;stroke-opacity:1"
         transform="scale(1,-1)" />
      <text
         xml:space="preserve"
         style="font-style:normal;font-variant:normal;font-weight:normal;font-stretch:normal;font-size:4.80917px;line-height:1.25;font-family:sans-serif;-inkscape-font-specification:'sans-serif, Normal';font-variant-ligatures:normal;font-variant-caps:normal;font-variant-numeric:normal;font-variant-east-asian:normal;letter-spacing:0px;word-spacing:0px;fill:#000000;fill-opacity:1;stroke:none;stroke-width:0.128816"
         x="122.82835"
         y="183.27762"
         id="text1142-5-7-8-1"
         transform="scale(1.0269778,0.97373088)"><tspan
           sodipodi:role="line"
           id="tspan1140-9-1-5-1"
           x="122.82835"
           y="183.27762"
           style="font-style:normal;font-variant:normal;font-weight:normal;font-stretch:normal;font-size:6.18318px;font-family:sans-serif;-inkscape-font-specification:'sans-serif, Normal';font-variant-ligatures:normal;font-variant-caps:normal;font-variant-numeric:normal;font-variant-east-asian:normal;stroke-width:0.128816">libostree agent</tspan></text>
    </g>
    <g
       id="g1957-2-5"
       transform="translate(19.690627,-79.083873)">
      <rect
         ry="0.73822922"
         y="-189.56671"
         x="117.14297"
         height="31.238171"
         width="66.332985"
         id="rect6571-2-9-9-9"
         style="display:inline;opacity:1;vector-effect:none;fill:#ffffff;fill-opacity:1;stroke:#552462;stroke-width:0.822402;stroke-linecap:butt;stroke-linejoin:miter;stroke-miterlimit:4;stroke-dasharray:none;stroke-dashoffset:0;stroke-opacity:1"
         transform="scale(1,-1)" />
      <text
         xml:space="preserve"
         style="font-style:normal;font-variant:normal;font-weight:normal;font-stretch:normal;font-size:4.9389px;line-height:1.25;font-family:sans-serif;-inkscape-font-specification:'sans-serif, Normal';font-variant-ligatures:normal;font-variant-caps:normal;font-variant-numeric:normal;font-variant-east-asian:normal;letter-spacing:0px;word-spacing:0px;fill:#000000;fill-opacity:1;stroke:none;stroke-width:0.132291"
         x="139.30858"
         y="165.92201"
         id="text1142-0-3-84"><tspan
           sodipodi:role="line"
           id="tspan1140-91-90-8"
           x="139.30858"
           y="165.92201"
           style="font-style:normal;font-variant:normal;font-weight:normal;font-stretch:normal;font-size:6.35px;font-family:sans-serif;-inkscape-font-specification:'sans-serif, Normal';font-variant-ligatures:normal;font-variant-caps:normal;font-variant-numeric:normal;font-variant-east-asian:normal;stroke-width:0.132291">Device</tspan></text>
      <rect
         ry="0.31916088"
         y="-183.55473"
         x="122.78583"
         height="13.505293"
         width="55.047256"
         id="rect6571-2-1-7-8-1"
         style="display:inline;opacity:1;vector-effect:none;fill:#ffffff;fill-opacity:1;stroke:#552462;stroke-width:0.803144;stroke-linecap:butt;stroke-linejoin:miter;stroke-miterlimit:4;stroke-dasharray:none;stroke-dashoffset:0;stroke-opacity:1"
         transform="scale(1,-1)" />
      <text
         xml:space="preserve"
         style="font-style:normal;font-variant:normal;font-weight:normal;font-stretch:normal;font-size:4.80917px;line-height:1.25;font-family:sans-serif;-inkscape-font-specification:'sans-serif, Normal';font-variant-ligatures:normal;font-variant-caps:normal;font-variant-numeric:normal;font-variant-east-asian:normal;letter-spacing:0px;word-spacing:0px;fill:#000000;fill-opacity:1;stroke:none;stroke-width:0.128816"
         x="122.82835"
         y="183.27762"
         id="text1142-5-7-8-0"
         transform="scale(1.0269778,0.97373088)"><tspan
           sodipodi:role="line"
           id="tspan1140-9-1-5-3"
           x="122.82835"
           y="183.27762"
           style="font-style:normal;font-variant:normal;font-weight:normal;font-stretch:normal;font-size:6.18318px;font-family:sans-serif;-inkscape-font-specification:'sans-serif, Normal';font-variant-ligatures:normal;font-variant-caps:normal;font-variant-numeric:normal;font-variant-east-asian:normal;stroke-width:0.128816">libostree agent</tspan></text>
    </g>
    <path
       sodipodi:nodetypes="cc"
       inkscape:connector-curvature="0"
       id="path901-1-4"
       d="M 97.256732,60.72416 140.88895,59.840746"
       style="display:inline;opacity:1;vector-effect:none;fill:none;fill-opacity:1;stroke:#000000;stroke-width:0.70662;stroke-linecap:butt;stroke-linejoin:miter;stroke-miterlimit:4;stroke-dasharray:none;stroke-dashoffset:0;stroke-opacity:1;marker-end:url(#Arrow2Lend-4-0)" />
    <path
       sodipodi:nodetypes="cc"
       inkscape:connector-curvature="0"
       id="path901-1-4-7"
       d="M 97.256732,60.72416 141.41812,26.627322"
       style="display:inline;opacity:1;vector-effect:none;fill:none;fill-opacity:1;stroke:#000000;stroke-width:0.70662;stroke-linecap:butt;stroke-linejoin:miter;stroke-miterlimit:4;stroke-dasharray:none;stroke-dashoffset:0;stroke-opacity:1;marker-end:url(#Arrow2Lend-4-0-4)" />
    <path
       sodipodi:nodetypes="cc"
       inkscape:connector-curvature="0"
       id="path901-1-4-7-1"
       d="M 97.256732,60.72416 141.41812,96.962648"
       style="display:inline;opacity:1;vector-effect:none;fill:none;fill-opacity:1;stroke:#000000;stroke-width:0.70662;stroke-linecap:butt;stroke-linejoin:miter;stroke-miterlimit:4;stroke-dasharray:none;stroke-dashoffset:0;stroke-opacity:1;marker-end:url(#Arrow2Lend-4-0-4-6)" />
  </g>
</svg>
