<?xml version="1.0" encoding="utf-8"?>
<!-- Generator: Adobe Illustrator 25.0.1, SVG Export Plug-In . SVG Version: 6.00 Build 0)  -->
<svg version="1.1" id="Capa_1" xmlns="http://www.w3.org/2000/svg" xmlns:xlink="http://www.w3.org/1999/xlink" x="0px" y="0px"
	 viewBox="0 0 512 512" style="enable-background:new 0 0 512 512;" xml:space="preserve">
<style type="text/css">
	.st0{fill:#E67D1E;}
</style>
<g>
	<g>
		<path class="st0" d="M508.87,478.71L360.14,329.98c28.21-34.83,45.19-79.1,45.19-127.31C405.33,90.92,314.42,0,202.67,0
			S0,90.92,0,202.67s90.92,202.67,202.67,202.67c48.21,0,92.48-16.98,127.31-45.19l148.73,148.73c4.17,4.17,10.92,4.17,15.09,0
			l15.08-15.08C513.04,489.63,513.04,482.87,508.87,478.71z M202.67,362.67c-88.23,0-160-71.77-160-160s71.77-160,160-160
			s160,71.77,160,160S290.9,362.67,202.67,362.67z"/>
	</g>
</g>
</svg>
