<?xml version="1.0" encoding="UTF-8" standalone="no"?>
<svg
   xmlns:dc="http://purl.org/dc/elements/1.1/"
   xmlns:cc="http://creativecommons.org/ns#"
   xmlns:rdf="http://www.w3.org/1999/02/22-rdf-syntax-ns#"
   xmlns:svg="http://www.w3.org/2000/svg"
   xmlns="http://www.w3.org/2000/svg"
   xmlns:sodipodi="http://sodipodi.sourceforge.net/DTD/sodipodi-0.dtd"
   xmlns:inkscape="http://www.inkscape.org/namespaces/inkscape"
   sodipodi:docname="virtual_keyboard.svg"
   inkscape:version="1.0 (4035a4fb49, 2020-05-01)"
   id="svg30235"
   version="1.1"
   viewBox="0 0 245.60768 84.378123"
   height="84.37812mm"
   width="245.60767mm">
  <defs
     id="defs30229">
    <marker
       inkscape:stockid="Arrow1Send"
       orient="auto"
       refY="0"
       refX="0"
       id="marker34362"
       style="overflow:visible"
       inkscape:isstock="true">
      <path
         id="path34360"
         d="M 0,0 5,-5 -12.5,0 5,5 Z"
         style="fill:#000000;fill-opacity:1;fill-rule:evenodd;stroke:#000000;stroke-width:1pt;stroke-opacity:1"
         transform="matrix(-0.2,0,0,-0.2,-1.2,0)" />
    </marker>
    <marker
       inkscape:isstock="true"
       style="overflow:visible"
       id="Arrow1Sstart"
       refX="0"
       refY="0"
       orient="auto"
       inkscape:stockid="Arrow1Sstart">
      <path
         transform="matrix(0.2,0,0,0.2,1.2,0)"
         style="fill:#000000;fill-opacity:1;fill-rule:evenodd;stroke:#000000;stroke-width:1pt;stroke-opacity:1"
         d="M 0,0 5,-5 -12.5,0 5,5 Z"
         id="path2457" />
    </marker>
    <marker
       inkscape:isstock="true"
       style="overflow:visible"
       id="Arrow1Send"
       refX="0"
       refY="0"
       orient="auto"
       inkscape:stockid="Arrow1Send">
      <path
         transform="matrix(-0.2,0,0,-0.2,-1.2,0)"
         style="fill:#000000;fill-opacity:1;fill-rule:evenodd;stroke:#000000;stroke-width:1pt;stroke-opacity:1"
         d="M 0,0 5,-5 -12.5,0 5,5 Z"
         id="path2460" />
    </marker>
    <marker
       inkscape:isstock="true"
       style="overflow:visible"
       id="marker31231"
       refX="0"
       refY="0"
       orient="auto"
       inkscape:stockid="Arrow1Mend">
      <path
         transform="matrix(-0.4,0,0,-0.4,-4,0)"
         style="fill:#000000;fill-opacity:1;fill-rule:evenodd;stroke:#000000;stroke-width:1pt;stroke-opacity:1"
         d="M 0,0 5,-5 -12.5,0 5,5 Z"
         id="path31229" />
    </marker>
    <marker
       inkscape:stockid="Arrow1Sstart"
       orient="auto"
       refY="0"
       refX="0"
       id="Arrow1Sstart-4"
       style="overflow:visible"
       inkscape:isstock="true">
      <path
         id="path2457-6"
         d="M 0,0 5,-5 -12.5,0 5,5 Z"
         style="fill:#000000;fill-opacity:1;fill-rule:evenodd;stroke:#000000;stroke-width:1pt;stroke-opacity:1"
         transform="matrix(0.2,0,0,0.2,1.2,0)" />
    </marker>
    <marker
       inkscape:stockid="Arrow1Send"
       orient="auto"
       refY="0"
       refX="0"
       id="Arrow1Send-9"
       style="overflow:visible"
       inkscape:isstock="true">
      <path
         id="path2460-2"
         d="M 0,0 5,-5 -12.5,0 5,5 Z"
         style="fill:#000000;fill-opacity:1;fill-rule:evenodd;stroke:#000000;stroke-width:1pt;stroke-opacity:1"
         transform="matrix(-0.2,0,0,-0.2,-1.2,0)" />
    </marker>
    <marker
       inkscape:stockid="Arrow1Sstart"
       orient="auto"
       refY="0"
       refX="0"
       id="Arrow1Sstart-8"
       style="overflow:visible"
       inkscape:isstock="true">
      <path
         id="path2457-2"
         d="M 0,0 5,-5 -12.5,0 5,5 Z"
         style="fill:#0000ff;fill-opacity:1;fill-rule:evenodd;stroke:#0000ff;stroke-width:1pt;stroke-opacity:1"
         transform="matrix(0.2,0,0,0.2,1.2,0)" />
    </marker>
    <marker
       inkscape:stockid="Arrow1Send"
       orient="auto"
       refY="0"
       refX="0"
       id="Arrow1Send-99"
       style="overflow:visible"
       inkscape:isstock="true">
      <path
         id="path2460-6"
         d="M 0,0 5,-5 -12.5,0 5,5 Z"
         style="fill:#0000ff;fill-opacity:1;fill-rule:evenodd;stroke:#0000ff;stroke-width:1pt;stroke-opacity:1"
         transform="matrix(-0.2,0,0,-0.2,-1.2,0)" />
    </marker>
    <marker
       inkscape:isstock="true"
       style="overflow:visible"
       id="Arrow1Sstart-4-0"
       refX="0"
       refY="0"
       orient="auto"
       inkscape:stockid="Arrow1Sstart">
      <path
         transform="matrix(0.2,0,0,0.2,1.2,0)"
         style="fill:#000000;fill-opacity:1;fill-rule:evenodd;stroke:#000000;stroke-width:1pt;stroke-opacity:1"
         d="M 0,0 5,-5 -12.5,0 5,5 Z"
         id="path2457-6-2" />
    </marker>
    <marker
       inkscape:isstock="true"
       style="overflow:visible"
       id="Arrow1Sstart-8-1"
       refX="0"
       refY="0"
       orient="auto"
       inkscape:stockid="Arrow1Sstart">
      <path
         transform="matrix(0.2,0,0,0.2,1.2,0)"
         style="fill:#000000;fill-opacity:1;fill-rule:evenodd;stroke:#000000;stroke-width:1pt;stroke-opacity:1"
         d="M 0,0 5,-5 -12.5,0 5,5 Z"
         id="path2457-2-0" />
    </marker>
    <marker
       inkscape:isstock="true"
       style="overflow:visible"
       id="Arrow1Send-99-4"
       refX="0"
       refY="0"
       orient="auto"
       inkscape:stockid="Arrow1Send">
      <path
         transform="matrix(-0.2,0,0,-0.2,-1.2,0)"
         style="fill:#000000;fill-opacity:1;fill-rule:evenodd;stroke:#000000;stroke-width:1pt;stroke-opacity:1"
         d="M 0,0 5,-5 -12.5,0 5,5 Z"
         id="path2460-6-2" />
    </marker>
    <marker
       inkscape:isstock="true"
       style="overflow:visible"
       id="Arrow1Sstart-8-2"
       refX="0"
       refY="0"
       orient="auto"
       inkscape:stockid="Arrow1Sstart">
      <path
         transform="matrix(0.2,0,0,0.2,1.2,0)"
         style="fill:#0000ff;fill-opacity:1;fill-rule:evenodd;stroke:#0000ff;stroke-width:1pt;stroke-opacity:1"
         d="M 0,0 5,-5 -12.5,0 5,5 Z"
         id="path2457-2-05" />
    </marker>
    <marker
       inkscape:isstock="true"
       style="overflow:visible"
       id="Arrow1Send-99-5"
       refX="0"
       refY="0"
       orient="auto"
       inkscape:stockid="Arrow1Send">
      <path
         transform="matrix(-0.2,0,0,-0.2,-1.2,0)"
         style="fill:#0000ff;fill-opacity:1;fill-rule:evenodd;stroke:#0000ff;stroke-width:1pt;stroke-opacity:1"
         d="M 0,0 5,-5 -12.5,0 5,5 Z"
         id="path2460-6-29" />
    </marker>
    <marker
       inkscape:isstock="true"
       style="overflow:visible"
       id="Arrow1Sstart-8-28"
       refX="0"
       refY="0"
       orient="auto"
       inkscape:stockid="Arrow1Sstart">
      <path
         transform="matrix(0.2,0,0,0.2,1.2,0)"
         style="fill:#000000;fill-opacity:1;fill-rule:evenodd;stroke:#000000;stroke-width:1pt;stroke-opacity:1"
         d="M 0,0 5,-5 -12.5,0 5,5 Z"
         id="path2457-2-3" />
    </marker>
    <marker
       inkscape:isstock="true"
       style="overflow:visible"
       id="Arrow1Send-99-8"
       refX="0"
       refY="0"
       orient="auto"
       inkscape:stockid="Arrow1Send">
      <path
         transform="matrix(-0.2,0,0,-0.2,-1.2,0)"
         style="fill:#000000;fill-opacity:1;fill-rule:evenodd;stroke:#000000;stroke-width:1pt;stroke-opacity:1"
         d="M 0,0 5,-5 -12.5,0 5,5 Z"
         id="path2460-6-0" />
    </marker>
    <marker
       inkscape:isstock="true"
       style="overflow:visible"
       id="Arrow1Sstart-8-0"
       refX="0"
       refY="0"
       orient="auto"
       inkscape:stockid="Arrow1Sstart">
      <path
         transform="matrix(0.2,0,0,0.2,1.2,0)"
         style="fill:#0000ff;fill-opacity:1;fill-rule:evenodd;stroke:#0000ff;stroke-width:1pt;stroke-opacity:1"
         d="M 0,0 5,-5 -12.5,0 5,5 Z"
         id="path2457-2-9" />
    </marker>
    <marker
       inkscape:isstock="true"
       style="overflow:visible"
       id="Arrow1Send-99-1"
       refX="0"
       refY="0"
       orient="auto"
       inkscape:stockid="Arrow1Send">
      <path
         transform="matrix(-0.2,0,0,-0.2,-1.2,0)"
         style="fill:#0000ff;fill-opacity:1;fill-rule:evenodd;stroke:#0000ff;stroke-width:1pt;stroke-opacity:1"
         d="M 0,0 5,-5 -12.5,0 5,5 Z"
         id="path2460-6-9" />
    </marker>
    <marker
       inkscape:stockid="Arrow1Sstart"
       orient="auto"
       refY="0"
       refX="0"
       id="Arrow1Sstart-8-1-6"
       style="overflow:visible"
       inkscape:isstock="true">
      <path
         id="path2457-2-0-2"
         d="M 0,0 5,-5 -12.5,0 5,5 Z"
         style="fill:#000000;fill-opacity:1;fill-rule:evenodd;stroke:#000000;stroke-width:1pt;stroke-opacity:1"
         transform="matrix(0.2,0,0,0.2,1.2,0)" />
    </marker>
    <marker
       inkscape:stockid="Arrow1Send"
       orient="auto"
       refY="0"
       refX="0"
       id="Arrow1Send-99-4-5"
       style="overflow:visible"
       inkscape:isstock="true">
      <path
         id="path2460-6-2-4"
         d="M 0,0 5,-5 -12.5,0 5,5 Z"
         style="fill:#000000;fill-opacity:1;fill-rule:evenodd;stroke:#000000;stroke-width:1pt;stroke-opacity:1"
         transform="matrix(-0.2,0,0,-0.2,-1.2,0)" />
    </marker>
  </defs>
  <sodipodi:namedview
     inkscape:window-maximized="1"
     inkscape:window-y="0"
     inkscape:window-x="0"
     inkscape:window-height="708"
     inkscape:window-width="1294"
     fit-margin-bottom="0"
     fit-margin-right="0"
     fit-margin-left="0"
     fit-margin-top="0"
     showgrid="false"
     inkscape:document-rotation="0"
     inkscape:current-layer="layer1"
     inkscape:document-units="mm"
     inkscape:cy="215.85293"
     inkscape:cx="435.30238"
     inkscape:zoom="0.66790123"
     inkscape:pageshadow="2"
     inkscape:pageopacity="0.0"
     borderopacity="1.0"
     bordercolor="#666666"
     pagecolor="#ffffff"
     id="base" />
  <metadata
     id="metadata30232">
    <rdf:RDF>
      <cc:Work
         rdf:about="">
        <dc:format>image/svg+xml</dc:format>
        <dc:type
           rdf:resource="http://purl.org/dc/dcmitype/StillImage" />
        <dc:title></dc:title>
      </cc:Work>
    </rdf:RDF>
  </metadata>
  <g
     transform="translate(-35.877449,-240.17882)"
     id="layer1"
     inkscape:groupmode="layer"
     inkscape:label="Layer 1">
    <rect
       ry="0"
       y="240.17882"
       x="35.877449"
       height="84.37812"
       width="245.60767"
       id="rect38952"
       style="color:#000000;overflow:visible;fill:#ffffff;fill-opacity:1;stroke:none;stroke-width:1.7475;stroke-linecap:round;stroke-linejoin:round;stroke-miterlimit:4;stroke-dasharray:none" />
    <g
       style="font-style:normal;font-variant:normal;font-weight:normal;font-stretch:normal;font-size:9.87778px;line-height:125%;font-family:'DejaVu Sans Mono';-inkscape-font-specification:'DejaVu Sans Mono';letter-spacing:0px;word-spacing:0px;fill:#000000;fill-opacity:1;stroke:none;stroke-width:0.264583px;stroke-linecap:butt;stroke-linejoin:miter;stroke-opacity:1"
       id="text30963-5"
       aria-label="input-method">
      <path
         id="path38433"
         style="font-style:normal;font-variant:normal;font-weight:normal;font-stretch:normal;font-size:9.87778px;font-family:'DejaVu Sans Mono';-inkscape-font-specification:'DejaVu Sans Mono';fill:#000000;fill-opacity:1;stroke:none;stroke-width:0.264583px"
         d="m 66.011799,309.50309 h 2.271697 v 4.7122 h 1.760444 v 0.68971 h -4.408345 v -0.68971 h 1.760444 v -4.02249 h -1.38424 z m 1.38424,-2.10289 h 0.887457 v 1.12379 h -0.887457 z" />
      <path
         id="path38435"
         style="font-style:normal;font-variant:normal;font-weight:normal;font-stretch:normal;font-size:9.87778px;font-family:'DejaVu Sans Mono';-inkscape-font-specification:'DejaVu Sans Mono';fill:#000000;fill-opacity:1;stroke:none;stroke-width:0.264583px"
         d="m 75.793117,311.55774 v 3.34726 h -0.89228 v -3.34726 q 0,-0.72829 -0.255627,-1.07073 -0.255626,-0.34245 -0.80064,-0.34245 -0.622184,0 -0.959804,0.44373 -0.332796,0.43891 -0.332796,1.26366 v 3.05305 h -0.887457 v -5.40191 h 0.887457 v 0.81028 q 0.236334,-0.46302 0.641477,-0.69935 0.405143,-0.24116 0.959804,-0.24116 0.824756,0 1.229899,0.54502 0.409967,0.54019 0.409967,1.63986 z" />
      <path
         id="path38437"
         style="font-style:normal;font-variant:normal;font-weight:normal;font-stretch:normal;font-size:9.87778px;font-family:'DejaVu Sans Mono';-inkscape-font-specification:'DejaVu Sans Mono';fill:#000000;fill-opacity:1;stroke:none;stroke-width:0.264583px"
         d="m 78.479603,314.22494 v 2.73471 h -0.89228 v -7.45656 h 0.89228 v 0.68971 q 0.221864,-0.40032 0.588422,-0.60772 0.371381,-0.21222 0.853695,-0.21222 0.979096,0 1.533757,0.75724 0.559483,0.75723 0.559483,2.09806 0,1.31671 -0.559483,2.06912 -0.559484,0.74759 -1.533757,0.74759 -0.49196,0 -0.863341,-0.2074 -0.366558,-0.21221 -0.578776,-0.61253 z m 2.604492,-2.01607 q 0,-1.03215 -0.327973,-1.55788 -0.32315,-0.52572 -0.964627,-0.52572 -0.6463,0 -0.979096,0.53055 -0.332796,0.52572 -0.332796,1.55305 0,1.0225 0.332796,1.55305 0.332796,0.53054 0.979096,0.53054 0.641477,0 0.964627,-0.52572 0.327973,-0.52572 0.327973,-1.55787 z" />
      <path
         id="path38439"
         style="font-style:normal;font-variant:normal;font-weight:normal;font-stretch:normal;font-size:9.87778px;font-family:'DejaVu Sans Mono';-inkscape-font-specification:'DejaVu Sans Mono';fill:#000000;fill-opacity:1;stroke:none;stroke-width:0.264583px"
         d="m 83.558363,312.85999 v -3.34726 h 0.887456 v 3.34726 q 0,0.72829 0.255626,1.07074 0.26045,0.34244 0.800641,0.34244 0.627007,0 0.959804,-0.43891 0.332796,-0.44373 0.332796,-1.26848 v -3.05305 h 0.89228 v 5.39227 h -0.89228 v -0.81029 q -0.236334,0.46785 -0.6463,0.709 -0.405143,0.24116 -0.950158,0.24116 -0.829579,0 -1.234722,-0.54019 -0.405143,-0.54502 -0.405143,-1.64469 z" />
      <path
         id="path38441"
         style="font-style:normal;font-variant:normal;font-weight:normal;font-stretch:normal;font-size:9.87778px;font-family:'DejaVu Sans Mono';-inkscape-font-specification:'DejaVu Sans Mono';fill:#000000;fill-opacity:1;stroke:none;stroke-width:0.264583px"
         d="m 91.526182,307.96933 v 1.53376 h 2.01607 v 0.68971 h -2.01607 v 2.93246 q 0,0.59807 0.226687,0.8344 0.226688,0.23634 0.790995,0.23634 h 0.998388 v 0.709 h -1.085205 q -0.998389,0 -1.408355,-0.40032 -0.409967,-0.40032 -0.409967,-1.37942 v -2.93246 h -1.442117 v -0.68971 h 1.442117 v -1.53376 z" />
      <path
         id="path38443"
         style="font-style:normal;font-variant:normal;font-weight:normal;font-stretch:normal;font-size:9.87778px;font-family:'DejaVu Sans Mono';-inkscape-font-specification:'DejaVu Sans Mono';fill:#000000;fill-opacity:1;stroke:none;stroke-width:0.264583px"
         d="m 96.228739,311.80372 h 2.512854 v 0.791 h -2.512854 z" />
      <path
         id="path38445"
         style="font-style:normal;font-variant:normal;font-weight:normal;font-stretch:normal;font-size:9.87778px;font-family:'DejaVu Sans Mono';-inkscape-font-specification:'DejaVu Sans Mono';fill:#000000;fill-opacity:1;stroke:none;stroke-width:0.264583px"
         d="m 103.71906,310.05293 q 0.16399,-0.34727 0.41479,-0.51126 0.25563,-0.16881 0.61254,-0.16881 0.65113,0 0.9164,0.50643 0.27009,0.50161 0.27009,1.89549 v 3.13022 h -0.81028 v -3.09163 q 0,-1.14308 -0.13023,-1.418 -0.1254,-0.27974 -0.46302,-0.27974 -0.38585,0 -0.53054,0.29903 -0.13987,0.29421 -0.13987,1.39871 v 3.09163 h -0.81029 v -3.09163 q 0,-1.15755 -0.13987,-1.42765 -0.13505,-0.27009 -0.49196,-0.27009 -0.35209,0 -0.49196,0.29903 -0.13505,0.29421 -0.13505,1.39871 v 3.09163 h -0.80546 v -5.40191 h 0.80546 v 0.46302 q 0.15916,-0.28939 0.3955,-0.43891 0.24115,-0.15434 0.54501,-0.15434 0.36656,0 0.60772,0.16881 0.24598,0.16881 0.38102,0.51126 z" />
      <path
         id="path38447"
         style="font-style:normal;font-variant:normal;font-weight:normal;font-stretch:normal;font-size:9.87778px;font-family:'DejaVu Sans Mono';-inkscape-font-specification:'DejaVu Sans Mono';fill:#000000;fill-opacity:1;stroke:none;stroke-width:0.264583px"
         d="m 111.76888,311.98218 v 0.43408 h -3.84404 v 0.0289 q 0,0.88263 0.4582,1.36495 0.46302,0.48231 1.30224,0.48231 0.42444,0 0.88746,-0.13505 0.46302,-0.13504 0.98874,-0.40996 v 0.88263 q -0.50643,0.20739 -0.97909,0.30868 -0.46785,0.10611 -0.90675,0.10611 -1.25884,0 -1.96784,-0.75241 -0.709,-0.75723 -0.709,-2.08359 0,-1.2926 0.69453,-2.06431 0.69453,-0.7717 1.85208,-0.7717 1.03215,0 1.6254,0.69936 0.59807,0.69935 0.59807,1.90996 z m -0.88746,-0.26045 q -0.0193,-0.78135 -0.37138,-1.18649 -0.34727,-0.40997 -1.00321,-0.40997 -0.64148,0 -1.05627,0.42444 -0.41479,0.42443 -0.49196,1.17684 z" />
      <path
         id="path38449"
         style="font-style:normal;font-variant:normal;font-weight:normal;font-stretch:normal;font-size:9.87778px;font-family:'DejaVu Sans Mono';-inkscape-font-specification:'DejaVu Sans Mono';fill:#000000;fill-opacity:1;stroke:none;stroke-width:0.264583px"
         d="m 115.31388,307.96933 v 1.53376 h 2.01607 v 0.68971 h -2.01607 v 2.93246 q 0,0.59807 0.22669,0.8344 0.22669,0.23634 0.79099,0.23634 h 0.99839 v 0.709 h -1.0852 q -0.99839,0 -1.40836,-0.40032 -0.40996,-0.40032 -0.40996,-1.37942 v -2.93246 h -1.44212 v -0.68971 h 1.44212 v -1.53376 z" />
      <path
         id="path38451"
         style="font-style:normal;font-variant:normal;font-weight:normal;font-stretch:normal;font-size:9.87778px;font-family:'DejaVu Sans Mono';-inkscape-font-specification:'DejaVu Sans Mono';fill:#000000;fill-opacity:1;stroke:none;stroke-width:0.264583px"
         d="m 123.36852,311.55774 v 3.34726 h -0.89228 v -3.34726 q 0,-0.72829 -0.25563,-1.07073 -0.25562,-0.34245 -0.80064,-0.34245 -0.62218,0 -0.9598,0.44373 -0.3328,0.43891 -0.3328,1.26366 v 3.05305 h -0.88745 v -7.5048 h 0.88745 v 2.91317 q 0.23634,-0.46302 0.64148,-0.69935 0.40514,-0.24116 0.9598,-0.24116 0.82476,0 1.2299,0.54502 0.40997,0.54019 0.40997,1.63986 z" />
      <path
         id="path38453"
         style="font-style:normal;font-variant:normal;font-weight:normal;font-stretch:normal;font-size:9.87778px;font-family:'DejaVu Sans Mono';-inkscape-font-specification:'DejaVu Sans Mono';fill:#000000;fill-opacity:1;stroke:none;stroke-width:0.264583px"
         d="m 127.21738,310.12527 q -0.67524,0 -1.0225,0.52572 -0.34727,0.52573 -0.34727,1.55788 0,1.02732 0.34727,1.55787 0.34726,0.52572 1.0225,0.52572 0.68006,0 1.02733,-0.52572 0.34726,-0.53055 0.34726,-1.55787 0,-1.03215 -0.34726,-1.55788 -0.34727,-0.52572 -1.02733,-0.52572 z m 0,-0.75241 q 1.12379,0 1.71704,0.7283 0.59807,0.72829 0.59807,2.10771 0,1.38424 -0.59325,2.11253 -0.59325,0.72347 -1.72186,0.72347 -1.12379,0 -1.71703,-0.72347 -0.59325,-0.72829 -0.59325,-2.11253 0,-1.37942 0.59325,-2.10771 0.59324,-0.7283 1.71703,-0.7283 z" />
      <path
         id="path38455"
         style="font-style:normal;font-variant:normal;font-weight:normal;font-stretch:normal;font-size:9.87778px;font-family:'DejaVu Sans Mono';-inkscape-font-specification:'DejaVu Sans Mono';fill:#000000;fill-opacity:1;stroke:none;stroke-width:0.264583px"
         d="m 134.3315,310.1928 v -2.7926 h 0.88746 v 7.5048 h -0.88746 v -0.68006 q -0.22186,0.40032 -0.59324,0.61253 -0.36656,0.2074 -0.84888,0.2074 -0.97909,0 -1.5434,-0.75723 -0.55948,-0.76206 -0.55948,-2.09807 0,-1.31671 0.5643,-2.0643 0.56431,-0.75241 1.53858,-0.75241 0.48714,0 0.85852,0.21222 0.37138,0.2074 0.5836,0.60772 z m -2.60931,2.01607 q 0,1.03215 0.32797,1.55787 0.32797,0.52572 0.96945,0.52572 0.64148,0 0.97427,-0.53054 0.33762,-0.53055 0.33762,-1.55305 0,-1.02733 -0.33762,-1.55305 -0.33279,-0.53055 -0.97427,-0.53055 -0.64148,0 -0.96945,0.52572 -0.32797,0.52573 -0.32797,1.55788 z" />
    </g>
    <g
       transform="matrix(0.1224467,0,0,0.1224467,113.68586,227.23716)"
       style="display:inline;opacity:0.94"
       id="g5133-8-3">
      <circle
         r="122.85714"
         cy="465.21933"
         cx="341.42856"
         id="path2985-6-6"
         style="fill:#ffbc00;fill-opacity:1;stroke:none" />
      <g
         id="text2987-04-8"
         style="font-style:normal;font-variant:normal;font-weight:bold;font-stretch:normal;font-size:437.474px;line-height:125%;letter-spacing:0px;word-spacing:0px;fill:#ffffff;fill-opacity:1;stroke:none"
         transform="scale(0.9155896,1.0921924)">
        <path
           sodipodi:nodetypes="cccccccccccccccccccccccccccccccccccccccccccsccccccccccccccccccccsccccccccccccccccccccccccccccccccccccccccccccccccccccccccccccccccccccccccccccccccccccccccccccccccccccccccccccccccccccccccccccccccccccccccccccccccccccccccccccccccccccccccccccccc"
           inkscape:connector-curvature="0"
           id="path2986-8-0"
           d="m 443.91049,314.59549 h 2.34971 l -1.49527,1.49528 h -0.85444 v -1.49528 m -173.02434,3.63138 v 1.70888 l -5.55387,6.83553 h -0.85444 l -0.85444,-5.34026 c 3.27538,-2.13591 5.69629,-3.20396 7.26275,-3.20415 m 202.50256,2.34971 c 4.84164,1.9e-4 7.54736,3.06194 8.11719,9.18524 l -4.0586,28.83739 h 1.49528 l 3.20415,-2.1361 h 0.85444 v 0.64083 c -4.41481,2.70589 -8.68701,10.11103 -12.81662,22.21547 -1.56666,10.39583 -4.20118,20.00828 -7.90358,28.83739 -3.27553,9.11414 -4.91321,17.51613 -4.91303,25.20602 l -6.1947,15.16633 c -1.7e-4,1.28172 2.34954,2.56338 7.04914,3.84498 -0.85462,2.9906 -2.13628,4.48587 -3.84499,4.48582 v 0.85444 h 1.49527 v 0.64083 c -1.7e-4,1.56653 -2.42108,2.34977 -7.26275,2.34971 l 0.85444,0.85444 v 2.99055 h -1.49527 c 0.99668,2.99059 3.13279,4.48586 6.40831,4.48581 v 1.49528 h -6.40831 v 0.85444 c 2.13594,4e-5 3.20399,1.2817 3.20416,3.84498 l -8.97163,2.99055 0.85444,0.85444 v 0.64083 c -1.6e-4,0.99688 -1.06821,1.4953 -3.20416,1.49527 v 0.85444 c 2.70557,3e-5 4.05844,0.49846 4.0586,1.49527 -3.84515,1.28169 -8.90058,7.61879 -15.16633,19.01132 -6.40845,10.11089 -11.96231,15.16633 -16.66161,15.16633 h -1.70888 c -3.56029,-2.27851 -6.47963,-9.82607 -8.75802,-22.64269 -9.11415,-19.5097 -13.67116,-30.97344 -13.67106,-34.39126 -1e-4,-8.82916 -2.91944,-18.228 -8.75802,-28.19656 -1.56657,-4.41452 -2.63462,-9.96839 -3.20416,-16.6616 l -3.84498,-0.85444 c -9.68375,14.66799 -14.73919,26.13173 -15.16633,34.39126 -2.7058,4.84189 -4.8419,10.68057 -6.40831,17.51604 5.83861,1.56652 8.75795,3.06179 8.75802,4.48582 v 0.85444 c -4.55709,-0.56959 -7.76124,-1.63764 -9.61246,-3.20416 -1.99376,3.84503 -4.62829,14.52553 -7.90358,32.04155 -2.56338,8.11719 -5.76753,12.17578 -9.61247,12.17578 -10.82295,-3.56016 -19.86578,-9.39884 -27.1285,-17.51604 -1.13928,2e-5 -2.99057,-4.05857 -5.55387,-12.17579 -1.56649,3e-5 -2.63454,-4.05856 -3.20415,-12.17578 -5.41147,-11.5349 -9.11405,-24.70753 -11.10774,-39.51791 v -22.21547 h -0.85444 l -3.84499,0.85444 v -0.85444 c 1e-5,-0.99674 1.28167,-1.49516 3.84499,-1.49527 l -0.85444,-12.81662 V 385.3005 l -6.1947,-32.04154 V 339.5879 c 2.70573,-8.54423 7.40515,-12.81643 14.09828,-12.81662 h 44.85816 v 1.49527 c -3.56022,0.14259 -5.98114,0.92583 -7.26275,2.34972 -2.70577,-1.5663 -5.3403,-2.34953 -7.90358,-2.34972 h -8.75802 l -4.91304,0.64083 -0.85444,-0.64083 h -0.64083 l -6.40831,0.64083 -3.20415,-0.64083 -2.34972,0.64083 -2.56332,-0.64083 c 10.39568,11.39272 16.51917,21.00518 18.37048,28.83739 h 7.26275 v 1.49527 h -5.55386 v 1.70889 c 2.13607,6.55086 3.70254,9.82621 4.69942,9.82607 h 1.70889 l 3.84498,-0.85444 0.85444,0.85444 0.85444,-0.85444 0.85444,0.85444 v 0.64083 c -2.84817,1.70902 -4.77066,4.05873 -5.76747,7.04914 h -0.64083 v 1.49527 h 1.49527 c 1.99366,23.78206 5.69623,41.79651 11.10773,54.04341 l 3.20416,2.1361 h 1.70888 c 2.13605,8e-5 6.62186,-8.33072 13.45745,-24.99241 4.41454,-7.54745 7.61869,-14.16936 9.61246,-19.86575 l -0.85444,-2.34972 c 4.41453,-5.55373 8.97155,-8.33066 13.67106,-8.3308 h 1.49527 c 2.99045,1.4e-4 5.12655,1.56661 6.40831,4.69943 3.98729,4.69955 7.19144,11.74868 9.61246,21.14742 l 11.96218,22.21547 c 1.56635,1.56656 2.34959,3.34664 2.34971,5.34026 4.41449,8.40207 8.40188,13.95593 11.96218,16.6616 h 2.56332 c 2.99041,6e-5 6.9778,-10.39563 11.96218,-31.1871 0.85429,9e-5 3.204,-5.55377 7.04914,-16.66161 v -0.85444 l -13.45745,-1.49527 -3.20416,0.85444 h -4.05859 v -1.70888 l 8.11719,-0.64083 h 15.80716 c 6.12333,-18.37035 11.7484,-32.61103 16.87521,-42.72206 1.70871,-20.79122 4.05842,-31.18691 7.04914,-31.1871 l 9.61247,-3.84499 m -45.49899,2.34971 c -0.85459,1.99389 -2.70588,2.99074 -5.55387,2.99055 v -1.49527 l 5.55387,-1.49528 m -80.53108,3.84499 h 21.57464 v 1.49527 l -4.91304,0.64083 -4.69943,-0.64083 -4.05859,1.49527 -1.49528,-1.49527 h -6.4083 v -1.49527 m -112.35902,2.99054 h 2.34972 l 1.49527,1.49528 v 0.85444 l -4.69943,4.48581 v 3.84499 h -1.70888 v -2.34971 l 0.85444,-0.64084 v -0.85444 l -4.0586,-3.84498 c 0.99691,-1.99352 2.9194,-2.99036 5.76748,-2.99055 m 157.00357,9.18525 h 2.34971 v 0.64083 c -1.1e-4,0.99702 -0.78335,1.49544 -2.34971,1.49527 l -0.85444,0.85444 v 0.85444 l -2.34972,-0.85444 v -1.49527 l 3.20416,-1.49527 m -11.96218,8.3308 v 0.85444 c -1e-4,1.13942 -3.41786,2.34988 -10.25329,3.63137 v -1.49527 l 4.69942,-2.1361 0.85444,0.64083 h 0.64083 l 4.0586,-1.49527 m -139.48752,7.68997 v 0.64083 l -1.70888,1.49527 -0.64083,-0.64083 v -0.85444 l 0.64083,-0.64083 h 1.70888 m 116.41761,0 v 0.64083 c -2.99062,2.27866 -7.83244,4.34356 -14.5255,6.1947 v -1.49527 c 1.13919,1.5e-4 1.70882,-0.78309 1.70888,-2.34972 l 12.81662,-2.99054 m 40.58595,7.47636 0.85445,0.85444 v 0.64083 l -1.49528,1.70888 h -0.85444 l -1.70888,-1.70888 v -0.64083 l 3.20415,-0.85444 m 29.47822,0.85444 h 0.85445 v 0.64083 l -1.49528,1.70888 H 425.54 v -0.85444 l 1.49527,-1.49527 m -13.45744,10.68051 3.20415,2.13611 c -0.56976,1.56661 -2.13623,2.34985 -4.69943,2.34971 l -1.70888,-2.34971 c -1.3e-4,-0.7119 1.06792,-1.42393 3.20416,-2.13611 m 19.22492,9.82608 0.64083,0.85444 v 0.64083 l -0.64083,0.85444 h -1.70888 v -0.85444 l 1.70888,-1.49527 m -30.33266,7.68997 v 0.64083 l -4.05859,3.20415 h -2.34972 v -0.85444 c -1.1e-4,-1.28154 2.13599,-2.27839 6.40831,-2.99054 m -132.43838,29.69183 h 0.85444 v 0.64083 c -2.13609,4.69951 -3.98737,7.54765 -5.55387,8.54441 h -1.70888 v -3.20415 l 6.40831,-5.98109 m 104.45543,35.67292 h 0.85444 v 1.49527 l -6.4083,3.20415 -0.85445,-0.85444 v -1.49527 l 6.40831,-2.34971 m -87.79383,10.03968 h 1.49527 l 2.56333,8.3308 h -1.70888 l -2.34972,-7.68997 v -0.64083 m 85.44412,9.82607 h 0.64083 l 2.56332,2.34972 -0.85444,0.64083 h -0.85444 l -1.49527,-2.1361 v -0.85445" />
      </g>
    </g>
    <g
       style="font-style:normal;font-variant:normal;font-weight:normal;font-stretch:normal;font-size:41.1385px;line-height:125%;font-family:Dyuthi;-inkscape-font-specification:Dyuthi;letter-spacing:0px;word-spacing:0px;display:inline;opacity:0.995;fill:none;stroke:#000000;stroke-width:1.37129px;stroke-linecap:butt;stroke-linejoin:miter;stroke-opacity:1"
       id="text1452-5-2-8-0-1"
       transform="scale(0.90149947,1.109263)"
       aria-label="P
">
      <path
         id="path38430"
         style="stroke-width:1.37129px"
         d="m 55.292388,245.92219 v 11.14837 h 2.892551 q 1.506536,0 2.631417,-1.20523 1.144968,-1.20523 1.144968,-4.35891 0,-3.1336 -1.144968,-4.35891 -1.144968,-1.22532 -2.631417,-1.22532 z m 4.640133,13.94049 -4.640133,0.0603 v 5.90562 q 0,1.24541 -0.883835,2.10916 -0.883835,0.86374 -2.04889,0.82357 h -0.08035 q -1.245404,0.0402 -2.04889,-0.84366 -0.883835,-0.80349 -0.883835,-2.08907 v -19.24349 q 0,-1.16506 0.883835,-2.04889 0.883835,-0.88384 2.129239,-0.88384 h 6.930069 q 0.723138,0 1.265491,0.10044 2.932725,0.44192 4.901267,2.73185 1.968541,2.28994 1.968541,5.02179 0,2.71177 -1.546711,5.12223 -2.068977,3.19385 -5.945799,3.23403 z" />
    </g>
    <g
       style="font-style:normal;font-variant:normal;font-weight:normal;font-stretch:normal;font-size:41.1385px;line-height:125%;font-family:Dyuthi;-inkscape-font-specification:Dyuthi;letter-spacing:0px;word-spacing:0px;display:inline;opacity:0.995;fill:none;stroke:#000000;stroke-width:1.37129px;stroke-linecap:butt;stroke-linejoin:miter;stroke-opacity:1"
       id="text1452-5-2-8"
       transform="scale(0.90149947,1.109263)"
       aria-label="A
">
      <path
         id="path38479"
         style="fill:none;stroke:#000000;stroke-width:1.37129px"
         d="m 284.12238,257.94526 h 6.52833 l -3.25412,-9.01913 z m 7.89425,-10.96759 q 0,0 6.40781,17.75705 0.52226,1.44628 -0.38166,2.69168 -0.90392,1.26549 -2.41046,1.26549 h -0.44191 q -0.96419,0 -1.78776,-0.60261 -0.82358,-0.58253 -0.98427,-1.46637 l -1.04453,-4.98161 h -7.61304 l -0.96418,4.92135 q -0.18079,0.96419 -1.02445,1.54671 -0.86374,0.58253 -2.00871,0.58253 h -0.44192 q -1.50654,0 -2.39037,-1.26549 -0.88384,-1.2454 -0.40174,-2.69168 l 6.0864,-17.6767 q 0.52227,-1.52662 1.80785,-2.43055 1.28558,-0.90392 2.61133,-0.90392 h 0.56244 q 1.30566,0 2.59124,0.90392 1.30567,0.90393 1.82793,2.3502 z" />
    </g>
    <path
       d="m 154.91493,342.4639 a 56.491051,56.491051 0 0 0 52.06753,-33.92239 56.491051,56.491051 0 0 0 -10.60091,-61.23215"
       style="color:#000000;overflow:visible;fill:none;fill-opacity:1;stroke:none;stroke-width:2;stroke-linecap:round;stroke-linejoin:round;stroke-miterlimit:4;stroke-dasharray:none"
       id="path33498" />
    <g
       style="font-style:normal;font-variant:normal;font-weight:normal;font-stretch:normal;font-size:9.87777px;line-height:125%;font-family:'DejaVu Sans Mono';-inkscape-font-specification:'DejaVu Sans Mono';letter-spacing:0px;word-spacing:0px;fill:#000000;fill-opacity:1;stroke:none;stroke-width:0.264583px;stroke-linecap:butt;stroke-linejoin:miter;stroke-opacity:1"
       id="text30963-5-7"
       aria-label="text-input">
      <path
         id="path38458"
         style="font-style:normal;font-variant:normal;font-weight:normal;font-stretch:normal;font-size:9.87777px;font-family:'DejaVu Sans Mono';-inkscape-font-specification:'DejaVu Sans Mono';fill:#000000;fill-opacity:1;stroke:none;stroke-width:0.264583px"
         d="m 183.28588,307.96934 v 1.53375 h 2.01607 v 0.68971 h -2.01607 v 2.93246 q 0,0.59807 0.22669,0.83441 0.22668,0.23633 0.79099,0.23633 h 0.99839 v 0.709 h -1.08521 q -0.99838,0 -1.40835,-0.40032 -0.40997,-0.40032 -0.40997,-1.37942 v -2.93246 h -1.44211 v -0.68971 h 1.44211 v -1.53375 z" />
      <path
         id="path38460"
         style="font-style:normal;font-variant:normal;font-weight:normal;font-stretch:normal;font-size:9.87777px;font-family:'DejaVu Sans Mono';-inkscape-font-specification:'DejaVu Sans Mono';fill:#000000;fill-opacity:1;stroke:none;stroke-width:0.264583px"
         d="m 191.63472,311.98218 v 0.43408 h -3.84404 v 0.0289 q 0,0.88264 0.4582,1.36495 0.46302,0.48231 1.30225,0.48231 0.42443,0 0.88745,-0.13505 0.46302,-0.13504 0.98874,-0.40996 v 0.88263 q -0.50643,0.20739 -0.97909,0.30868 -0.46785,0.10611 -0.90675,0.10611 -1.25884,0 -1.96784,-0.75241 -0.709,-0.75723 -0.709,-2.08359 0,-1.2926 0.69453,-2.0643 0.69453,-0.7717 1.85209,-0.7717 1.03215,0 1.62539,0.69935 0.59807,0.69936 0.59807,1.90996 z m -0.88746,-0.26045 q -0.0193,-0.78134 -0.37138,-1.18649 -0.34726,-0.40996 -1.00321,-0.40996 -0.64148,0 -1.05627,0.42443 -0.41478,0.42444 -0.49195,1.17685 z" />
      <path
         id="path38462"
         style="font-style:normal;font-variant:normal;font-weight:normal;font-stretch:normal;font-size:9.87777px;font-family:'DejaVu Sans Mono';-inkscape-font-specification:'DejaVu Sans Mono';fill:#000000;fill-opacity:1;stroke:none;stroke-width:0.264583px"
         d="m 197.61058,309.50309 -1.93408,2.5852 2.12218,2.81671 h -1.02733 l -1.58198,-2.16559 -1.57717,2.16559 h -1.02733 l 2.12218,-2.81671 -1.93407,-2.5852 h 0.98392 l 1.43247,1.95337 1.42282,-1.95337 z" />
      <path
         id="path38464"
         style="font-style:normal;font-variant:normal;font-weight:normal;font-stretch:normal;font-size:9.87777px;font-family:'DejaVu Sans Mono';-inkscape-font-specification:'DejaVu Sans Mono';fill:#000000;fill-opacity:1;stroke:none;stroke-width:0.264583px"
         d="m 201.12664,307.96934 v 1.53375 h 2.01607 v 0.68971 h -2.01607 v 2.93246 q 0,0.59807 0.22669,0.83441 0.22668,0.23633 0.79099,0.23633 h 0.99839 v 0.709 h -1.08521 q -0.99838,0 -1.40835,-0.40032 -0.40997,-0.40032 -0.40997,-1.37942 v -2.93246 h -1.44211 v -0.68971 h 1.44211 v -1.53375 z" />
      <path
         id="path38466"
         style="font-style:normal;font-variant:normal;font-weight:normal;font-stretch:normal;font-size:9.87777px;font-family:'DejaVu Sans Mono';-inkscape-font-specification:'DejaVu Sans Mono';fill:#000000;fill-opacity:1;stroke:none;stroke-width:0.264583px"
         d="m 205.82919,311.80373 h 2.51285 v 0.79099 h -2.51285 z" />
      <path
         id="path38468"
         style="font-style:normal;font-variant:normal;font-weight:normal;font-stretch:normal;font-size:9.87777px;font-family:'DejaVu Sans Mono';-inkscape-font-specification:'DejaVu Sans Mono';fill:#000000;fill-opacity:1;stroke:none;stroke-width:0.264583px"
         d="m 211.2938,309.50309 h 2.27169 v 4.7122 h 1.76044 v 0.68971 h -4.40834 v -0.68971 h 1.76044 v -4.02249 h -1.38423 z m 1.38423,-2.10288 h 0.88746 v 1.12379 h -0.88746 z" />
      <path
         id="path38470"
         style="font-style:normal;font-variant:normal;font-weight:normal;font-stretch:normal;font-size:9.87777px;font-family:'DejaVu Sans Mono';-inkscape-font-specification:'DejaVu Sans Mono';fill:#000000;fill-opacity:1;stroke:none;stroke-width:0.264583px"
         d="m 221.07511,311.55775 v 3.34725 h -0.89228 v -3.34725 q 0,-0.7283 -0.25563,-1.07074 -0.25562,-0.34244 -0.80064,-0.34244 -0.62218,0 -0.9598,0.44373 -0.3328,0.4389 -0.3328,1.26366 v 3.05304 h -0.88745 v -5.40191 h 0.88745 v 0.81029 q 0.23634,-0.46302 0.64148,-0.69935 0.40514,-0.24116 0.9598,-0.24116 0.82476,0 1.2299,0.54501 0.40997,0.54019 0.40997,1.63987 z" />
      <path
         id="path38472"
         style="font-style:normal;font-variant:normal;font-weight:normal;font-stretch:normal;font-size:9.87777px;font-family:'DejaVu Sans Mono';-inkscape-font-specification:'DejaVu Sans Mono';fill:#000000;fill-opacity:1;stroke:none;stroke-width:0.264583px"
         d="m 223.76159,314.22494 v 2.73471 h -0.89228 v -7.45656 h 0.89228 v 0.68971 q 0.22186,-0.40032 0.58842,-0.60771 0.37138,-0.21222 0.85369,-0.21222 0.9791,0 1.53376,0.75723 0.55948,0.75723 0.55948,2.09806 0,1.31672 -0.55948,2.06912 -0.55948,0.74759 -1.53376,0.74759 -0.49195,0 -0.86334,-0.2074 -0.36655,-0.21221 -0.57877,-0.61253 z m 2.60449,-2.01607 q 0,-1.03215 -0.32797,-1.55787 -0.32315,-0.52572 -0.96463,-0.52572 -0.6463,0 -0.9791,0.53054 -0.33279,0.52572 -0.33279,1.55305 0,1.0225 0.33279,1.55305 0.3328,0.53054 0.9791,0.53054 0.64148,0 0.96463,-0.52572 0.32797,-0.52572 0.32797,-1.55787 z" />
      <path
         id="path38474"
         style="font-style:normal;font-variant:normal;font-weight:normal;font-stretch:normal;font-size:9.87777px;font-family:'DejaVu Sans Mono';-inkscape-font-specification:'DejaVu Sans Mono';fill:#000000;fill-opacity:1;stroke:none;stroke-width:0.264583px"
         d="m 228.84034,312.85999 v -3.34725 h 0.88746 v 3.34725 q 0,0.72829 0.25563,1.07074 0.26044,0.34244 0.80064,0.34244 0.627,0 0.9598,-0.43891 0.33279,-0.44372 0.33279,-1.26848 v -3.05304 h 0.89228 v 5.39226 h -0.89228 v -0.81029 q -0.23633,0.46785 -0.6463,0.709 -0.40514,0.24116 -0.95015,0.24116 -0.82958,0 -1.23472,-0.54019 -0.40515,-0.54501 -0.40515,-1.64469 z" />
      <path
         id="path38476"
         style="font-style:normal;font-variant:normal;font-weight:normal;font-stretch:normal;font-size:9.87777px;font-family:'DejaVu Sans Mono';-inkscape-font-specification:'DejaVu Sans Mono';fill:#000000;fill-opacity:1;stroke:none;stroke-width:0.264583px"
         d="m 236.80815,307.96934 v 1.53375 h 2.01607 v 0.68971 h -2.01607 v 2.93246 q 0,0.59807 0.22669,0.83441 0.22669,0.23633 0.79099,0.23633 h 0.99839 v 0.709 h -1.0852 q -0.99839,0 -1.40836,-0.40032 -0.40996,-0.40032 -0.40996,-1.37942 v -2.93246 h -1.44212 v -0.68971 h 1.44212 v -1.53375 z" />
    </g>
    <g
       style="font-style:normal;font-variant:normal;font-weight:normal;font-stretch:normal;font-size:9.87777px;line-height:125%;font-family:'DejaVu Sans Mono';-inkscape-font-specification:'DejaVu Sans Mono';letter-spacing:0px;word-spacing:0px;fill:#0000ff;fill-opacity:1;stroke:#0000ff;stroke-width:0.264583px;stroke-linecap:butt;stroke-linejoin:miter;stroke-opacity:1"
       id="text30963-5-1"
       aria-label="virtual-keyboard">
      <path
         id="path38397"
         style="font-style:normal;font-variant:normal;font-weight:normal;font-stretch:normal;font-size:9.87777px;font-family:'DejaVu Sans Mono';-inkscape-font-specification:'DejaVu Sans Mono';fill:#0000ff;fill-opacity:1;stroke:#0000ff;stroke-width:0.264583px"
         d="m 53.553686,252.84361 h 0.921218 l 1.567517,4.53374 1.572341,-4.53374 h 0.921217 l -1.919605,5.4019 h -1.143082 z" />
      <path
         id="path38399"
         style="font-style:normal;font-variant:normal;font-weight:normal;font-stretch:normal;font-size:9.87777px;font-family:'DejaVu Sans Mono';-inkscape-font-specification:'DejaVu Sans Mono';fill:#0000ff;fill-opacity:1;stroke:#0000ff;stroke-width:0.264583px"
         d="m 60.253014,252.84361 h 2.271694 v 4.7122 h 1.760442 v 0.6897 h -4.40834 v -0.6897 h 1.760442 v -4.02249 h -1.384238 z m 1.384238,-2.10289 h 0.887456 v 1.12379 h -0.887456 z" />
      <path
         id="path38401"
         style="font-style:normal;font-variant:normal;font-weight:normal;font-stretch:normal;font-size:9.87777px;font-family:'DejaVu Sans Mono';-inkscape-font-specification:'DejaVu Sans Mono';fill:#0000ff;fill-opacity:1;stroke:#0000ff;stroke-width:0.264583px"
         d="m 70.535927,253.95775 q -0.284565,-0.22186 -0.578775,-0.32315 -0.294211,-0.10128 -0.6463,-0.10128 -0.829578,0 -1.268483,0.52089 -0.438905,0.5209 -0.438905,1.50482 v 2.68648 h -0.892279 v -5.4019 h 0.892279 v 1.05626 q 0.221864,-0.57395 0.680061,-0.87781 0.463021,-0.30868 1.094851,-0.30868 0.327973,0 0.612537,0.082 0.284565,0.082 0.545014,0.25562 z" />
      <path
         id="path38403"
         style="font-style:normal;font-variant:normal;font-weight:normal;font-stretch:normal;font-size:9.87777px;font-family:'DejaVu Sans Mono';-inkscape-font-specification:'DejaVu Sans Mono';fill:#0000ff;fill-opacity:1;stroke:#0000ff;stroke-width:0.264583px"
         d="m 73.873534,251.30985 v 1.53376 h 2.016069 v 0.68971 h -2.016069 v 2.93246 q 0,0.59807 0.226687,0.8344 0.226687,0.23633 0.790994,0.23633 h 0.998388 v 0.709 h -1.085205 q -0.998388,0 -1.408354,-0.40032 -0.409966,-0.40032 -0.409966,-1.37941 v -2.93246 h -1.442116 v -0.68971 h 1.442116 v -1.53376 z" />
      <path
         id="path38405"
         style="font-style:normal;font-variant:normal;font-weight:normal;font-stretch:normal;font-size:9.87777px;font-family:'DejaVu Sans Mono';-inkscape-font-specification:'DejaVu Sans Mono';fill:#0000ff;fill-opacity:1;stroke:#0000ff;stroke-width:0.264583px"
         d="m 77.799561,256.20051 v -3.34726 h 0.887456 v 3.34726 q 0,0.72829 0.255626,1.07073 0.260449,0.34244 0.80064,0.34244 0.627006,0 0.959802,-0.4389 0.332796,-0.44373 0.332796,-1.26848 v -3.05305 h 0.892279 v 5.39226 h -0.892279 v -0.81028 q -0.236333,0.46784 -0.646299,0.709 -0.405143,0.24115 -0.950157,0.24115 -0.829578,0 -1.234721,-0.54019 -0.405143,-0.54501 -0.405143,-1.64468 z" />
      <path
         id="path38407"
         style="font-style:normal;font-variant:normal;font-weight:normal;font-stretch:normal;font-size:9.87777px;font-family:'DejaVu Sans Mono';-inkscape-font-specification:'DejaVu Sans Mono';fill:#0000ff;fill-opacity:1;stroke:#0000ff;stroke-width:0.264583px"
         d="m 86.191807,255.53009 h -0.294211 q -0.776524,0 -1.172021,0.27492 -0.390674,0.2701 -0.390674,0.81029 0,0.48713 0.294211,0.75723 0.294211,0.27009 0.815109,0.27009 0.733116,0 1.152728,-0.50643 0.419613,-0.51125 0.424436,-1.40835 v -0.19775 z m 1.721857,-0.36656 v 3.08198 h -0.892279 v -0.80064 q -0.284565,0.48232 -0.718646,0.71383 -0.429259,0.22668 -1.04662,0.22668 -0.824755,0 -1.316714,-0.46302 -0.491959,-0.46784 -0.491959,-1.24919 0,-0.90192 0.602891,-1.36977 0.607714,-0.46784 1.779735,-0.46784 h 1.191313 v -0.13987 q -0.0048,-0.6463 -0.327973,-0.93569 -0.32315,-0.29421 -1.03215,-0.29421 -0.453374,0 -0.916394,0.13023 -0.463021,0.13022 -0.901926,0.38102 v -0.88745 q 0.491959,-0.1881 0.940511,-0.27974 0.453374,-0.0965 0.877809,-0.0965 0.670415,0 1.143082,0.19775 0.47749,0.19775 0.771701,0.59325 0.183279,0.24115 0.260449,0.59807 0.07717,0.35208 0.07717,1.06108 z" />
      <path
         id="path38409"
         style="font-style:normal;font-variant:normal;font-weight:normal;font-stretch:normal;font-size:9.87777px;font-family:'DejaVu Sans Mono';-inkscape-font-specification:'DejaVu Sans Mono';fill:#0000ff;fill-opacity:1;stroke:#0000ff;stroke-width:0.264583px"
         d="m 91.834872,256.28732 q 0,0.59807 0.217041,0.90193 0.221864,0.30386 0.651122,0.30386 h 1.036973 v 0.7524 h -1.123789 q -0.795817,0 -1.234722,-0.51125 -0.434081,-0.51125 -0.434081,-1.44694 v -4.90512 h -1.422824 v -0.69453 h 2.31028 z" />
      <path
         id="path38411"
         style="font-style:normal;font-variant:normal;font-weight:normal;font-stretch:normal;font-size:9.87777px;font-family:'DejaVu Sans Mono';-inkscape-font-specification:'DejaVu Sans Mono';fill:#0000ff;fill-opacity:1;stroke:#0000ff;stroke-width:0.264583px"
         d="m 96.416844,255.14424 h 2.512851 v 0.79099 h -2.512851 z" />
      <path
         id="path38413"
         style="font-style:normal;font-variant:normal;font-weight:normal;font-stretch:normal;font-size:9.87777px;font-family:'DejaVu Sans Mono';-inkscape-font-specification:'DejaVu Sans Mono';fill:#0000ff;fill-opacity:1;stroke:#0000ff;stroke-width:0.264583px"
         d="m 101.78499,250.74072 h 0.91639 v 4.34564 l 2.32957,-2.24275 h 1.08038 l -2.127,2.03536 2.4598,3.36654 h -1.0852 l -1.99678,-2.78777 -0.66077,0.62219 v 2.16558 h -0.91639 z" />
      <path
         id="path38415"
         style="font-style:normal;font-variant:normal;font-weight:normal;font-stretch:normal;font-size:9.87777px;font-family:'DejaVu Sans Mono';-inkscape-font-specification:'DejaVu Sans Mono';fill:#0000ff;fill-opacity:1;stroke:#0000ff;stroke-width:0.264583px"
         d="m 111.95697,255.3227 v 0.43408 h -3.84404 v 0.0289 q 0,0.88263 0.4582,1.36494 0.46302,0.48232 1.30225,0.48232 0.42443,0 0.88745,-0.13505 0.46302,-0.13505 0.98874,-0.40997 v 0.88264 q -0.50643,0.20739 -0.97909,0.30868 -0.46785,0.1061 -0.90675,0.1061 -1.25884,0 -1.96784,-0.7524 -0.709,-0.75724 -0.709,-2.0836 0,-1.29259 0.69453,-2.0643 0.69453,-0.7717 1.85208,-0.7717 1.03215,0 1.6254,0.69936 0.59807,0.69935 0.59807,1.90996 z m -0.88746,-0.26045 q -0.0193,-0.78135 -0.37138,-1.18649 -0.34726,-0.40997 -1.00321,-0.40997 -0.64148,0 -1.05627,0.42444 -0.41479,0.42443 -0.49196,1.17684 z" />
      <path
         id="path38417"
         style="font-style:normal;font-variant:normal;font-weight:normal;font-stretch:normal;font-size:9.87777px;font-family:'DejaVu Sans Mono';-inkscape-font-specification:'DejaVu Sans Mono';fill:#0000ff;fill-opacity:1;stroke:#0000ff;stroke-width:0.264583px"
         d="m 116.67881,256.50919 q -0.22186,0.5643 -0.56431,1.48552 -0.47748,1.27331 -0.64147,1.55305 -0.22187,0.3762 -0.55466,0.56431 -0.3328,0.1881 -0.77653,0.1881 h -0.71382 v -0.74276 h 0.52572 q 0.39068,0 0.61254,-0.22669 0.22186,-0.22669 0.56431,-1.17202 l -2.08842,-5.31509 h 0.94051 l 1.60128,4.22506 1.57716,-4.22506 h 0.94051 z" />
      <path
         id="path38419"
         style="font-style:normal;font-variant:normal;font-weight:normal;font-stretch:normal;font-size:9.87777px;font-family:'DejaVu Sans Mono';-inkscape-font-specification:'DejaVu Sans Mono';fill:#0000ff;fill-opacity:1;stroke:#0000ff;stroke-width:0.264583px"
         d="m 122.91512,255.54938 q 0,-1.03215 -0.32797,-1.55787 -0.32797,-0.52572 -0.96945,-0.52572 -0.6463,0 -0.9791,0.53055 -0.33279,0.52572 -0.33279,1.55304 0,1.02251 0.33279,1.55305 0.3328,0.53055 0.9791,0.53055 0.64148,0 0.96945,-0.52572 0.32797,-0.52573 0.32797,-1.55788 z m -2.60931,-2.01606 q 0.21222,-0.3955 0.5836,-0.60772 0.3762,-0.21222 0.86816,-0.21222 0.97427,0 1.53376,0.75241 0.55948,0.74759 0.55948,2.0643 0,1.33601 -0.56431,2.09806 -0.55948,0.75723 -1.53858,0.75723 -0.48231,0 -0.85369,-0.20739 -0.36656,-0.21222 -0.58842,-0.61254 v 0.68006 h -0.88746 v -7.50479 h 0.88746 z" />
      <path
         id="path38421"
         style="font-style:normal;font-variant:normal;font-weight:normal;font-stretch:normal;font-size:9.87777px;font-family:'DejaVu Sans Mono';-inkscape-font-specification:'DejaVu Sans Mono';fill:#0000ff;fill-opacity:1;stroke:#0000ff;stroke-width:0.264583px"
         d="m 127.40546,253.46579 q -0.67524,0 -1.02251,0.52572 -0.34726,0.52572 -0.34726,1.55787 0,1.02733 0.34726,1.55788 0.34727,0.52572 1.02251,0.52572 0.68006,0 1.02732,-0.52572 0.34727,-0.53055 0.34727,-1.55788 0,-1.03215 -0.34727,-1.55787 -0.34726,-0.52572 -1.02732,-0.52572 z m 0,-0.75241 q 1.12379,0 1.71703,0.7283 0.59807,0.72829 0.59807,2.1077 0,1.38424 -0.59324,2.11254 -0.59325,0.72346 -1.72186,0.72346 -1.12379,0 -1.71704,-0.72346 -0.59324,-0.7283 -0.59324,-2.11254 0,-1.37941 0.59324,-2.1077 0.59325,-0.7283 1.71704,-0.7283 z" />
      <path
         id="path38423"
         style="font-style:normal;font-variant:normal;font-weight:normal;font-stretch:normal;font-size:9.87777px;font-family:'DejaVu Sans Mono';-inkscape-font-specification:'DejaVu Sans Mono';fill:#0000ff;fill-opacity:1;stroke:#0000ff;stroke-width:0.264583px"
         d="m 133.76716,255.53009 h -0.29421 q -0.77652,0 -1.17202,0.27492 -0.39067,0.2701 -0.39067,0.81029 0,0.48713 0.29421,0.75723 0.29421,0.27009 0.81511,0.27009 0.73311,0 1.15273,-0.50643 0.41961,-0.51125 0.42443,-1.40835 v -0.19775 z m 1.72186,-0.36656 v 3.08198 h -0.89228 v -0.80064 q -0.28456,0.48232 -0.71865,0.71383 -0.42925,0.22668 -1.04662,0.22668 -0.82475,0 -1.31671,-0.46302 -0.49196,-0.46784 -0.49196,-1.24919 0,-0.90192 0.60289,-1.36977 0.60772,-0.46784 1.77974,-0.46784 h 1.19131 v -0.13987 q -0.005,-0.6463 -0.32797,-0.93569 -0.32315,-0.29421 -1.03215,-0.29421 -0.45338,0 -0.9164,0.13023 -0.46302,0.13022 -0.90192,0.38102 v -0.88745 q 0.49196,-0.1881 0.94051,-0.27974 0.45337,-0.0965 0.87781,-0.0965 0.67041,0 1.14308,0.19775 0.47749,0.19775 0.7717,0.59325 0.18328,0.24115 0.26045,0.59807 0.0772,0.35208 0.0772,1.06108 z" />
      <path
         id="path38425"
         style="font-style:normal;font-variant:normal;font-weight:normal;font-stretch:normal;font-size:9.87777px;font-family:'DejaVu Sans Mono';-inkscape-font-specification:'DejaVu Sans Mono';fill:#0000ff;fill-opacity:1;stroke:#0000ff;stroke-width:0.264583px"
         d="m 141.89896,253.95775 q -0.28456,-0.22186 -0.57877,-0.32315 -0.29421,-0.10128 -0.6463,-0.10128 -0.82958,0 -1.26849,0.52089 -0.4389,0.5209 -0.4389,1.50482 v 2.68648 h -0.89228 v -5.4019 h 0.89228 v 1.05626 q 0.22186,-0.57395 0.68006,-0.87781 0.46302,-0.30868 1.09485,-0.30868 0.32797,0 0.61254,0.082 0.28456,0.082 0.54501,0.25562 z" />
      <path
         id="path38427"
         style="font-style:normal;font-variant:normal;font-weight:normal;font-stretch:normal;font-size:9.87777px;font-family:'DejaVu Sans Mono';-inkscape-font-specification:'DejaVu Sans Mono';fill:#0000ff;fill-opacity:1;stroke:#0000ff;stroke-width:0.264583px"
         d="m 146.41341,253.53332 v -2.7926 h 0.88745 v 7.50479 h -0.88745 v -0.68006 q -0.22187,0.40032 -0.59325,0.61254 -0.36656,0.20739 -0.84887,0.20739 -0.97909,0 -1.5434,-0.75723 -0.55948,-0.76205 -0.55948,-2.09806 0,-1.31671 0.5643,-2.0643 0.56431,-0.75241 1.53858,-0.75241 0.48714,0 0.85852,0.21222 0.37138,0.2074 0.5836,0.60772 z m -2.60932,2.01606 q 0,1.03215 0.32798,1.55788 0.32797,0.52572 0.96945,0.52572 0.64147,0 0.97427,-0.53055 0.33762,-0.53054 0.33762,-1.55305 0,-1.02732 -0.33762,-1.55304 -0.3328,-0.53055 -0.97427,-0.53055 -0.64148,0 -0.96945,0.52572 -0.32798,0.52572 -0.32798,1.55787 z" />
    </g>
    <g
       style="font-style:normal;font-variant:normal;font-weight:normal;font-stretch:normal;font-size:9.87777px;line-height:125%;font-family:'DejaVu Sans Mono';-inkscape-font-specification:'DejaVu Sans Mono';letter-spacing:0px;word-spacing:0px;fill:#0000ff;fill-opacity:1;stroke:#0000ff;stroke-width:0.264583px;stroke-linecap:butt;stroke-linejoin:miter;stroke-opacity:1"
       id="text30963-5-7-4"
       aria-label="wl_keyboard">
      <path
         id="path38374"
         style="font-style:normal;font-variant:normal;font-weight:normal;font-stretch:normal;font-size:9.87777px;font-family:'DejaVu Sans Mono';-inkscape-font-specification:'DejaVu Sans Mono';fill:#0000ff;fill-opacity:1;stroke:#0000ff;stroke-width:0.264583px"
         d="m 177.24667,252.70616 h 0.87781 l 0.94051,4.36493 0.7717,-2.78777 h 0.75724 l 0.78134,2.78777 0.94051,-4.36493 h 0.87781 l -1.26366,5.4019 h -0.84887 l -0.86334,-2.9614 -0.85852,2.9614 h -0.84887 z" />
      <path
         id="path38376"
         style="font-style:normal;font-variant:normal;font-weight:normal;font-stretch:normal;font-size:9.87777px;font-family:'DejaVu Sans Mono';-inkscape-font-specification:'DejaVu Sans Mono';fill:#0000ff;fill-opacity:1;stroke:#0000ff;stroke-width:0.264583px"
         d="m 186.27557,256.14987 q 0,0.59807 0.21704,0.90193 0.22187,0.30385 0.65113,0.30385 h 1.03697 v 0.75241 h -1.12379 q -0.79582,0 -1.23472,-0.51125 -0.43408,-0.51125 -0.43408,-1.44694 v -4.90512 h -1.42283 v -0.69453 h 2.31028 z" />
      <path
         id="path38378"
         style="font-style:normal;font-variant:normal;font-weight:normal;font-stretch:normal;font-size:9.87777px;font-family:'DejaVu Sans Mono';-inkscape-font-specification:'DejaVu Sans Mono';fill:#0000ff;fill-opacity:1;stroke:#0000ff;stroke-width:0.264583px"
         d="m 195.08743,260.05178 v 0.38585 h -5.94692 v -0.38585 z" />
      <path
         id="path38380"
         style="font-style:normal;font-variant:normal;font-weight:normal;font-stretch:normal;font-size:9.87777px;font-family:'DejaVu Sans Mono';-inkscape-font-specification:'DejaVu Sans Mono';fill:#0000ff;fill-opacity:1;stroke:#0000ff;stroke-width:0.264583px"
         d="m 196.22569,250.60327 h 0.9164 v 4.34564 l 2.32957,-2.24275 h 1.08038 l -2.127,2.03536 2.4598,3.36654 h -1.08521 l -1.99677,-2.78777 -0.66077,0.62219 v 2.16558 h -0.9164 z" />
      <path
         id="path38382"
         style="font-style:normal;font-variant:normal;font-weight:normal;font-stretch:normal;font-size:9.87777px;font-family:'DejaVu Sans Mono';-inkscape-font-specification:'DejaVu Sans Mono';fill:#0000ff;fill-opacity:1;stroke:#0000ff;stroke-width:0.264583px"
         d="m 206.39767,255.18525 v 0.43408 h -3.84403 v 0.0289 q 0,0.88263 0.45819,1.36494 0.46303,0.48232 1.30225,0.48232 0.42444,0 0.88746,-0.13505 0.46302,-0.13505 0.98874,-0.40997 v 0.88263 q -0.50643,0.2074 -0.9791,0.30868 -0.46784,0.10611 -0.90675,0.10611 -1.25883,0 -1.96783,-0.7524 -0.709,-0.75724 -0.709,-2.0836 0,-1.2926 0.69453,-2.0643 0.69453,-0.7717 1.85208,-0.7717 1.03215,0 1.62539,0.69936 0.59807,0.69935 0.59807,1.90996 z m -0.88745,-0.26045 q -0.0193,-0.78135 -0.37138,-1.18649 -0.34727,-0.40997 -1.00322,-0.40997 -0.64147,0 -1.05626,0.42444 -0.41479,0.42443 -0.49196,1.17684 z" />
      <path
         id="path38384"
         style="font-style:normal;font-variant:normal;font-weight:normal;font-stretch:normal;font-size:9.87777px;font-family:'DejaVu Sans Mono';-inkscape-font-specification:'DejaVu Sans Mono';fill:#0000ff;fill-opacity:1;stroke:#0000ff;stroke-width:0.264583px"
         d="m 211.11952,256.37174 q -0.22187,0.5643 -0.56431,1.48552 -0.47749,1.27331 -0.64148,1.55305 -0.22186,0.3762 -0.55466,0.5643 -0.33279,0.18811 -0.77652,0.18811 h -0.71382 v -0.74277 h 0.52572 q 0.39067,0 0.61253,-0.22668 0.22187,-0.22669 0.56431,-1.17202 l -2.08841,-5.31509 h 0.94051 l 1.60127,4.22506 1.57717,-4.22506 h 0.94051 z" />
      <path
         id="path38386"
         style="font-style:normal;font-variant:normal;font-weight:normal;font-stretch:normal;font-size:9.87777px;font-family:'DejaVu Sans Mono';-inkscape-font-specification:'DejaVu Sans Mono';fill:#0000ff;fill-opacity:1;stroke:#0000ff;stroke-width:0.264583px"
         d="m 217.35583,255.41193 q 0,-1.03215 -0.32798,-1.55787 -0.32797,-0.52572 -0.96945,-0.52572 -0.6463,0 -0.97909,0.53055 -0.3328,0.52572 -0.3328,1.55304 0,1.02251 0.3328,1.55305 0.33279,0.53055 0.97909,0.53055 0.64148,0 0.96945,-0.52573 0.32798,-0.52572 0.32798,-1.55787 z m -2.60932,-2.01607 q 0.21222,-0.39549 0.5836,-0.60771 0.37621,-0.21222 0.86816,-0.21222 0.97428,0 1.53376,0.75241 0.55948,0.74759 0.55948,2.0643 0,1.33601 -0.5643,2.09806 -0.55949,0.75723 -1.53858,0.75723 -0.48231,0 -0.8537,-0.20739 -0.36655,-0.21222 -0.58842,-0.61254 v 0.68006 h -0.88745 v -7.50479 h 0.88745 z" />
      <path
         id="path38388"
         style="font-style:normal;font-variant:normal;font-weight:normal;font-stretch:normal;font-size:9.87777px;font-family:'DejaVu Sans Mono';-inkscape-font-specification:'DejaVu Sans Mono';fill:#0000ff;fill-opacity:1;stroke:#0000ff;stroke-width:0.264583px"
         d="m 221.84616,253.32834 q -0.67524,0 -1.0225,0.52572 -0.34727,0.52572 -0.34727,1.55787 0,1.02733 0.34727,1.55787 0.34726,0.52573 1.0225,0.52573 0.68006,0 1.02733,-0.52573 0.34726,-0.53054 0.34726,-1.55787 0,-1.03215 -0.34726,-1.55787 -0.34727,-0.52572 -1.02733,-0.52572 z m 0,-0.75241 q 1.12379,0 1.71703,0.7283 0.59807,0.72829 0.59807,2.1077 0,1.38424 -0.59324,2.11253 -0.59325,0.72347 -1.72186,0.72347 -1.12379,0 -1.71704,-0.72347 -0.59324,-0.72829 -0.59324,-2.11253 0,-1.37941 0.59324,-2.1077 0.59325,-0.7283 1.71704,-0.7283 z" />
      <path
         id="path38390"
         style="font-style:normal;font-variant:normal;font-weight:normal;font-stretch:normal;font-size:9.87777px;font-family:'DejaVu Sans Mono';-inkscape-font-specification:'DejaVu Sans Mono';fill:#0000ff;fill-opacity:1;stroke:#0000ff;stroke-width:0.264583px"
         d="m 228.20787,255.39264 h -0.29421 q -0.77653,0 -1.17203,0.27492 -0.39067,0.27009 -0.39067,0.81028 0,0.48714 0.29421,0.75724 0.29421,0.27009 0.81511,0.27009 0.73312,0 1.15273,-0.50643 0.41961,-0.51125 0.42443,-1.40835 v -0.19775 z m 1.72185,-0.36656 v 3.08198 h -0.89228 v -0.80064 q -0.28456,0.48232 -0.71864,0.71383 -0.42926,0.22668 -1.04662,0.22668 -0.82476,0 -1.31672,-0.46302 -0.49195,-0.46784 -0.49195,-1.24919 0,-0.90192 0.60289,-1.36977 0.60771,-0.46784 1.77973,-0.46784 h 1.19131 v -0.13987 q -0.005,-0.6463 -0.32797,-0.93569 -0.32315,-0.29421 -1.03215,-0.29421 -0.45337,0 -0.91639,0.13023 -0.46302,0.13022 -0.90193,0.38102 v -0.88745 q 0.49196,-0.18811 0.94051,-0.27974 0.45338,-0.0965 0.87781,-0.0965 0.67042,0 1.14308,0.19775 0.47749,0.19775 0.7717,0.59325 0.18328,0.24115 0.26045,0.59806 0.0772,0.35209 0.0772,1.06109 z" />
      <path
         id="path38392"
         style="font-style:normal;font-variant:normal;font-weight:normal;font-stretch:normal;font-size:9.87777px;font-family:'DejaVu Sans Mono';-inkscape-font-specification:'DejaVu Sans Mono';fill:#0000ff;fill-opacity:1;stroke:#0000ff;stroke-width:0.264583px"
         d="m 236.33966,253.8203 q -0.28456,-0.22186 -0.57877,-0.32315 -0.29421,-0.10129 -0.6463,-0.10129 -0.82958,0 -1.26849,0.5209 -0.4389,0.5209 -0.4389,1.50482 v 2.68648 h -0.89228 v -5.4019 h 0.89228 v 1.05626 q 0.22186,-0.57395 0.68006,-0.87781 0.46302,-0.30868 1.09485,-0.30868 0.32797,0 0.61254,0.082 0.28456,0.082 0.54501,0.25562 z" />
      <path
         id="path38394"
         style="font-style:normal;font-variant:normal;font-weight:normal;font-stretch:normal;font-size:9.87777px;font-family:'DejaVu Sans Mono';-inkscape-font-specification:'DejaVu Sans Mono';fill:#0000ff;fill-opacity:1;stroke:#0000ff;stroke-width:0.264583px"
         d="m 240.85411,253.39586 v -2.79259 h 0.88746 v 7.50479 h -0.88746 V 257.428 q -0.22186,0.40032 -0.59324,0.61254 -0.36656,0.20739 -0.84887,0.20739 -0.9791,0 -1.54341,-0.75723 -0.55948,-0.76205 -0.55948,-2.09806 0,-1.31671 0.56431,-2.0643 0.5643,-0.75241 1.53858,-0.75241 0.48713,0 0.85851,0.21222 0.37138,0.20739 0.5836,0.60771 z m -2.60931,2.01607 q 0,1.03215 0.32797,1.55787 0.32797,0.52573 0.96945,0.52573 0.64148,0 0.97427,-0.53055 0.33762,-0.53054 0.33762,-1.55305 0,-1.02732 -0.33762,-1.55304 -0.33279,-0.53055 -0.97427,-0.53055 -0.64148,0 -0.96945,0.52572 -0.32797,0.52572 -0.32797,1.55787 z" />
    </g>
    <path
       sodipodi:nodetypes="cc"
       style="display:inline;fill:#0000ff;fill-rule:evenodd;stroke:#0000ff;stroke-width:2;stroke-linecap:butt;stroke-linejoin:miter;stroke-miterlimit:4;stroke-dasharray:none;stroke-opacity:1;marker-start:url(#Arrow1Sstart-8);marker-end:url(#Arrow1Send-99)"
       d="m 80.64677,275.34982 h 39.56101"
       id="path7485-6-9" />
    <path
       id="path7485-6-9-2"
       d="m 80.64677,293.05364 h 39.56101"
       style="display:inline;fill:none;fill-rule:evenodd;stroke:#000000;stroke-width:2;stroke-linecap:butt;stroke-linejoin:miter;stroke-miterlimit:4;stroke-dasharray:none;stroke-opacity:1;marker-start:url(#Arrow1Sstart-8-1);marker-end:url(#Arrow1Send-99-4)"
       sodipodi:nodetypes="cc" />
    <g
       id="g37503">
      <path
         sodipodi:nodetypes="cc"
         style="display:inline;fill:#0000ff;fill-rule:evenodd;stroke:#0000ff;stroke-width:2;stroke-linecap:butt;stroke-linejoin:miter;stroke-miterlimit:4;stroke-dasharray:none;stroke-opacity:1;marker-start:url(#Arrow1Sstart-8-0);marker-end:url(#Arrow1Send-99-1)"
         d="m 189.71362,275.34982 h 39.56101"
         id="path7485-6-9-9" />
      <path
         id="path7485-6-9-2-9"
         d="m 189.71362,293.05364 h 39.56101"
         style="display:inline;fill:none;fill-rule:evenodd;stroke:#000000;stroke-width:2;stroke-linecap:butt;stroke-linejoin:miter;stroke-miterlimit:4;stroke-dasharray:none;stroke-opacity:1;marker-start:url(#Arrow1Sstart-8-1-6);marker-end:url(#Arrow1Send-99-4-5)"
         sodipodi:nodetypes="cc" />
    </g>
  </g>
</svg>
