<?xml version="1.0" encoding="utf-8"?>
<!-- Generator: Adobe Illustrator 25.0.1, SVG Export Plug-In . SVG Version: 6.00 Build 0)  -->
<svg version="1.1" id="_x30_3._LOGO" xmlns="http://www.w3.org/2000/svg" xmlns:xlink="http://www.w3.org/1999/xlink" x="0px"
	 y="0px" viewBox="0 0 248.65 235.85" style="enable-background:new 0 0 248.65 235.85;" xml:space="preserve">
<style type="text/css">
	.st0{fill:#FFFFFF;}
</style>
<g id="g10_3_" transform="matrix(1.25,0,0,-1.25,0,799.99999)">
	<g id="g12_4_" transform="scale(0.1,0.1)">
		<path id="path14_4_" class="st0" d="M999.45,5906.35l168.43-291.77c133.72-23.01,258.42-72.91,368.1-143.95L999.45,6400
			l-536.6-929.37c109.77,71.04,234.43,120.94,368.15,143.95L999.45,5906.35"/>
		<path id="path16_4_" class="st0" d="M1469.12,5402.6c-73.11,45.07-153.21,80-238.2,102.75c-73.88,19.74-151.4,30.4-231.48,30.4
			c-80.04,0-157.64-10.66-231.56-30.4c-84.99-22.75-165.05-57.68-238.16-102.75c-138.95-85.76-252.78-208.39-327.97-354.07h293.47
			c119.32,146.57,300.98,240.4,504.21,240.4c203.23,0,384.98-93.84,504.14-240.4h293.46
			C1721.95,5194.21,1608.04,5316.84,1469.12,5402.6"/>
		<path id="path18_4_" class="st0" d="M144.2,4841.84h33.83l150.54-328.61h-49.14l-44.78,96.84H91.34l-41.94-96.84H0L144.2,4841.84
			L144.2,4841.84z M214.91,4651.64l-54.22,118.41l-50.23-118.41H214.91"/>
		<path id="path20_4_" class="st0" d="M397.28,4513.23v301.17h106.7c32.13,0,57.76-7.7,76.92-23.22c19.1-15.47,28.7-36.32,28.7-62.5
			c0-17.46-4.96-32.93-14.72-46.43c-9.81-13.53-23.16-23.33-40.26-29.39c-17.05-6.08-41.44-9.17-73.28-9.17h-35.63v-130.45H397.28
			L397.28,4513.23z M495.61,4776.12h-49.9v-94.08h52.75c19.63,0,34.77,4.14,45.27,12.39c10.64,8.21,15.94,20,15.94,35.39
			C559.66,4760.65,538.3,4776.12,495.61,4776.12"/>
		<path id="path22_4_" class="st0" d="M678.27,4813.55h190.84v-38.32H726.44v-91.72h137.9v-38.53h-137.9v-93.44h147.23v-38.31
			H678.27V4813.55"/>
		<path id="path24_4_" class="st0" d="M980.66,4513.23v300.79h84.45c33.99,0,61.05-7.57,81.06-22.63
			c19.91-15.05,29.98-35.43,29.98-61.19c0-17.46-4.91-32.6-14.8-45.41c-9.65-12.69-23.76-22.25-42.12-28.59
			c10.83-6.3,21.3-14.97,31.63-25.88c10.23-10.96,24.69-29.94,43.29-57.09c11.77-17.09,21.19-29.89,28.25-38.48l17.84-21.53h-57.41
			l-14.64,19.83c-0.47,0.73-1.43,1.91-2.88,3.59l-9.39,11.89l-14.97,21.95L1124.9,4594c-9.98,12.38-19.11,22.16-27.4,29.48
			c-8.29,7.27-15.72,12.64-22.31,15.77c-6.73,3.25-18,4.86-33.77,4.86h-12.56v-130.88H980.66L980.66,4513.23z M1043.38,4777.39
			h-14.52v-94.96h18.31c24.44,0,41.2,1.85,50.25,5.62c9.13,3.72,16.15,9.39,21.27,16.91c5.06,7.54,7.56,16.16,7.56,25.71
			c0,9.52-2.79,18.06-8.41,25.75c-5.61,7.65-13.56,13.11-23.8,16.23C1083.88,4775.83,1066.98,4777.39,1043.38,4777.39"/>
		<path id="path26_4_" class="st0" d="M1259.63,4814.4h281.24v-38.28h-117.35v-262.89h-48.44v262.89h-115.45V4814.4"/>
		<path id="path28_4_" class="st0" d="M1620.5,4513.23h48.21v300.79h-48.21V4513.23z"/>
		<path id="path30_4_" class="st0" d="M1872.94,4651.29l-47.61,21.23c-29.77,13.37-51,26.48-63.59,39.42
			c-12.62,12.94-18.95,27.86-18.95,44.65c0,25.29,11.94,45.8,35.81,61.61c23.9,15.69,54.88,23.64,93.07,23.64
			c36.49,0,69.95-7.56,100.4-22.62v-52.1c-31.48,22.24-65.38,33.37-101.67,33.37c-20.41,0-37.2-3.52-50.37-10.41
			c-13.14-6.93-19.69-15.82-19.69-26.64c0-9.6,4.85-18.61,14.5-26.94c9.73-8.45,25.27-17.21,46.67-26.47l47.8-20.8
			c53.29-23.34,79.92-53.07,79.92-89.23c0-25.75-11.67-46.59-35.18-62.67c-23.43-16.03-53.97-24.1-91.51-24.1
			c-43.18,0-82.43,9.68-117.9,29.23v58.3c33.84-31.41,72.86-47.14,117.3-47.14c19.63,0,35.95,4.02,48.98,12.01
			c13.05,8.04,19.53,18.01,19.53,30.06C1930.45,4615.28,1911.34,4633.75,1872.94,4651.29"/>
	</g>
</g>
</svg>
