<?xml version="1.0" encoding="UTF-8" standalone="no"?>
<svg
   xmlns:dc="http://purl.org/dc/elements/1.1/"
   xmlns:cc="http://creativecommons.org/ns#"
   xmlns:rdf="http://www.w3.org/1999/02/22-rdf-syntax-ns#"
   xmlns:svg="http://www.w3.org/2000/svg"
   xmlns="http://www.w3.org/2000/svg"
   xmlns:sodipodi="http://sodipodi.sourceforge.net/DTD/sodipodi-0.dtd"
   xmlns:inkscape="http://www.inkscape.org/namespaces/inkscape"
   version="1.1"
   viewBox="0 0 985.48693 638.93598"
   stroke-miterlimit="10"
   id="svg4241"
   sodipodi:docname="product_production.svg"
   inkscape:version="0.92.4 5da689c313, 2019-01-14"
   width="985.48694"
   height="638.93597"
   style="fill:none;stroke:none;stroke-linecap:square;stroke-miterlimit:10">
  <metadata
     id="metadata4247">
    <rdf:RDF>
      <cc:Work
         rdf:about="">
        <dc:format>image/svg+xml</dc:format>
        <dc:type
           rdf:resource="http://purl.org/dc/dcmitype/StillImage" />
        <dc:title />
      </cc:Work>
    </rdf:RDF>
  </metadata>
  <defs
     id="defs4245" />
  <sodipodi:namedview
     pagecolor="#ffffff"
     bordercolor="#666666"
     borderopacity="1"
     objecttolerance="10"
     gridtolerance="10"
     guidetolerance="10"
     inkscape:pageopacity="0"
     inkscape:pageshadow="2"
     inkscape:window-width="3062"
     inkscape:window-height="1343"
     id="namedview4243"
     showgrid="true"
     inkscape:snap-to-guides="true"
     inkscape:snap-grids="false"
     inkscape:zoom="1.4628272"
     inkscape:cx="328.28699"
     inkscape:cy="327.14876"
     inkscape:window-x="199"
     inkscape:window-y="0"
     inkscape:window-maximized="0"
     inkscape:current-layer="svg4241"
     inkscape:lockguides="false"
     inkscape:measure-start="273.057,285.233"
     inkscape:measure-end="824.842,285.233"
     inkscape:snap-text-baseline="true"
     inkscape:snap-bbox="true">
    <inkscape:grid
       type="xygrid"
       id="grid4367"
       originx="-66.772441"
       originy="-64.766727" />
  </sodipodi:namedview>
  <clipPath
     id="g3da239b7c3_0_49.0">
    <path
       d="M 0,0 H 960 V 540 H 0 Z"
       id="path4000"
       inkscape:connector-curvature="0"
       style="clip-rule:nonzero" />
  </clipPath>
  <path
     style="fill:#000000;fill-opacity:0;fill-rule:evenodd"
     inkscape:connector-curvature="0"
     id="path4089"
     d="M 47.715746,497.01767 H 862.73944" />
  <text
     xml:space="preserve"
     style="font-style:normal;font-weight:normal;font-size:13.33333302px;line-height:1.25;font-family:sans-serif;letter-spacing:0px;word-spacing:0px;fill:#000000;fill-opacity:1;stroke:none"
     x="303.31036"
     y="611.77521"
     id="text4478"><tspan
       sodipodi:role="line"
       id="tspan4476"
       x="303.31036"
       y="611.77521">'21Q1</tspan></text>
  <text
     xml:space="preserve"
     style="font-style:normal;font-weight:normal;font-size:13.33333302px;line-height:1.25;font-family:sans-serif;letter-spacing:0px;word-spacing:0px;fill:#000000;fill-opacity:1;stroke:none"
     x="353.37521"
     y="631.67694"
     id="text4482"><tspan
       sodipodi:role="line"
       id="tspan4480"
       x="353.37521"
       y="631.67694">'21Q2</tspan></text>
  <text
     xml:space="preserve"
     style="font-style:normal;font-weight:normal;font-size:13.33333302px;line-height:1.25;font-family:sans-serif;letter-spacing:0px;word-spacing:0px;fill:#000000;fill-opacity:1;stroke:none"
     x="403.25455"
     y="611.77521"
     id="text4486"><tspan
       sodipodi:role="line"
       id="tspan4484"
       x="403.25455"
       y="611.77521">'21Q3</tspan></text>
  <text
     xml:space="preserve"
     style="font-style:normal;font-weight:normal;font-size:13.33333302px;line-height:1.25;font-family:sans-serif;letter-spacing:0px;word-spacing:0px;fill:#000000;fill-opacity:1;stroke:none"
     x="453.10788"
     y="631.67694"
     id="text4490"><tspan
       sodipodi:role="line"
       id="tspan4488"
       x="453.10788"
       y="631.67694">'21Q4</tspan></text>
  <text
     xml:space="preserve"
     style="font-style:normal;font-weight:normal;font-size:13.33333302px;line-height:1.25;font-family:sans-serif;letter-spacing:0px;word-spacing:0px;fill:#000000;fill-opacity:1;stroke:none"
     x="103.39985"
     y="611.77521"
     id="text4494"><tspan
       sodipodi:role="line"
       id="tspan4492"
       x="103.39985"
       y="611.77521">'20Q1</tspan></text>
  <text
     xml:space="preserve"
     style="font-style:normal;font-weight:normal;font-size:13.33333302px;line-height:1.25;font-family:sans-serif;letter-spacing:0px;word-spacing:0px;fill:#000000;fill-opacity:1;stroke:none"
     x="153.46472"
     y="631.67694"
     id="text4498"><tspan
       sodipodi:role="line"
       id="tspan4496"
       x="153.46472"
       y="631.67694">'20Q2</tspan></text>
  <text
     xml:space="preserve"
     style="font-style:normal;font-weight:normal;font-size:13.33333302px;line-height:1.25;font-family:sans-serif;letter-spacing:0px;word-spacing:0px;fill:#000000;fill-opacity:1;stroke:none"
     x="203.34401"
     y="611.77521"
     id="text4502"><tspan
       sodipodi:role="line"
       id="tspan4500"
       x="203.34401"
       y="611.77521">'20Q3</tspan></text>
  <text
     xml:space="preserve"
     style="font-style:normal;font-weight:normal;font-size:13.33333302px;line-height:1.25;font-family:sans-serif;letter-spacing:0px;word-spacing:0px;fill:#000000;fill-opacity:1;stroke:none"
     x="254.74809"
     y="631.67694"
     id="text4506"><tspan
       sodipodi:role="line"
       id="tspan4504"
       x="254.74809"
       y="631.67694">'20Q4</tspan></text>
  <text
     xml:space="preserve"
     style="font-style:normal;font-weight:normal;font-size:13.33333302px;line-height:1.25;font-family:sans-serif;letter-spacing:0px;word-spacing:0px;fill:#000000;fill-opacity:1;stroke:none"
     x="503.36145"
     y="611.77521"
     id="text4510"><tspan
       sodipodi:role="line"
       id="tspan4508"
       x="503.36145"
       y="611.77521">'22Q1</tspan></text>
  <text
     xml:space="preserve"
     style="font-style:normal;font-weight:normal;font-size:13.33333302px;line-height:1.25;font-family:sans-serif;letter-spacing:0px;word-spacing:0px;fill:#000000;fill-opacity:1;stroke:none"
     x="553.42633"
     y="631.67694"
     id="text4514"><tspan
       sodipodi:role="line"
       id="tspan4512"
       x="553.42633"
       y="631.67694">'22Q2</tspan></text>
  <text
     xml:space="preserve"
     style="font-style:normal;font-weight:normal;font-size:40px;line-height:1.25;font-family:sans-serif;letter-spacing:0px;word-spacing:0px;fill:#000000;fill-opacity:1;stroke:none"
     x="1013.2276"
     y="183.7027"
     id="text4518"><tspan
       sodipodi:role="line"
       id="tspan4516"
       x="1013.2276"
       y="219.09332" /></text>
  <text
     xml:space="preserve"
     style="font-style:normal;font-weight:normal;font-size:13.33333302px;line-height:1.25;font-family:sans-serif;letter-spacing:0px;word-spacing:0px;fill:#000000;fill-opacity:1;stroke:none"
     x="603.30566"
     y="611.77521"
     id="text4514-5"><tspan
       sodipodi:role="line"
       id="tspan4512-3"
       x="603.30566"
       y="611.77521">'22Q3</tspan></text>
  <text
     xml:space="preserve"
     style="font-style:normal;font-weight:normal;font-size:13.33333302px;line-height:1.25;font-family:sans-serif;letter-spacing:0px;word-spacing:0px;fill:#000000;fill-opacity:1;stroke:none"
     x="53.146172"
     y="631.67694"
     id="text4494-5"><tspan
       sodipodi:role="line"
       id="tspan4492-6"
       x="53.146172"
       y="631.67694">'19Q4</tspan></text>
  <text
     xml:space="preserve"
     style="font-style:normal;font-weight:normal;font-size:13.33333302px;line-height:1.25;font-family:sans-serif;letter-spacing:0px;word-spacing:0px;fill:#000000;fill-opacity:1;stroke:none"
     x="653.18457"
     y="636.63916"
     id="text4514-5-0-1"><tspan
       sodipodi:role="line"
       id="tspan4512-3-6-5"
       x="653.18457"
       y="636.63916">'22Q4</tspan></text>
  <text
     xml:space="preserve"
     style="font-style:normal;font-weight:normal;font-size:13.33333302px;line-height:1.25;font-family:sans-serif;letter-spacing:0px;word-spacing:0px;fill:#000000;fill-opacity:1;stroke:none"
     x="703.43817"
     y="611.77521"
     id="text4514-5-0-1-9"><tspan
       sodipodi:role="line"
       id="tspan4512-3-6-5-4"
       x="703.43817"
       y="611.77521">'23Q1</tspan></text>
  <text
     xml:space="preserve"
     style="font-style:normal;font-weight:normal;font-size:13.33333302px;line-height:1.25;font-family:sans-serif;letter-spacing:0px;word-spacing:0px;fill:#000000;fill-opacity:1;stroke:none"
     x="851.33191"
     y="637.21722"
     id="text4514-5-0-1-9-9"><tspan
       sodipodi:role="line"
       id="tspan4512-3-6-5-4-0"
       x="851.33191"
       y="637.21722">'23Q4</tspan></text>
  <text
     xml:space="preserve"
     style="font-style:normal;font-weight:normal;font-size:13.33333302px;line-height:1.25;font-family:sans-serif;letter-spacing:0px;word-spacing:0px;fill:#000000;fill-opacity:1;stroke:none"
     x="803.38239"
     y="611.77521"
     id="text4514-5-0-1-9-9-9"><tspan
       sodipodi:role="line"
       id="tspan4512-3-6-5-4-0-1"
       x="803.38239"
       y="611.77521">'23Q3</tspan></text>
  <text
     xml:space="preserve"
     style="font-style:normal;font-weight:normal;font-size:13.33333302px;line-height:1.25;font-family:sans-serif;letter-spacing:0px;word-spacing:0px;fill:#000000;fill-opacity:1;stroke:none"
     x="748.72614"
     y="637.21722"
     id="text4514-5-0-1-9-9-3"><tspan
       sodipodi:role="line"
       id="tspan4512-3-6-5-4-0-6"
       x="748.72614"
       y="637.21722">'23Q2</tspan></text>
  <path
     style="fill:#000000;fill-opacity:0;fill-rule:evenodd"
     inkscape:connector-curvature="0"
     id="path4093-9"
     d="m 279.6954,298.24141 v 12.78738" />
  <path
     style="fill-rule:evenodd;stroke:#611bb8;stroke-width:3.13902307;stroke-linecap:butt;stroke-linejoin:round"
     inkscape:connector-curvature="0"
     id="path4095-1"
     d="m 274.84239,295.32146 v 14" />
  <text
     xml:space="preserve"
     style="font-style:normal;font-weight:normal;font-size:16px;line-height:1.25;font-family:sans-serif;letter-spacing:0px;word-spacing:0px;fill:#000000;fill-opacity:1;stroke:none"
     x="315.57153"
     y="-268.87756"
     id="text4390-2"
     transform="rotate(90)"><tspan
       sodipodi:role="line"
       id="tspan4388-7"
       x="315.57153"
       y="-268.87756">22dev0</tspan></text>
  <path
     style="fill-rule:evenodd;stroke:#611bb8;stroke-width:3.13902307;stroke-linecap:butt;stroke-linejoin:round"
     inkscape:connector-curvature="0"
     id="path4099-9"
     d="m 324.85518,295.32146 v 14" />
  <text
     xml:space="preserve"
     style="font-style:normal;font-weight:normal;font-size:16px;line-height:1.25;font-family:sans-serif;letter-spacing:0px;word-spacing:0px;fill:#000000;fill-opacity:1;stroke:none"
     x="315.57153"
     y="-318.89035"
     id="text4394-3"
     transform="rotate(90)"><tspan
       sodipodi:role="line"
       id="tspan4392-6"
       x="315.57153"
       y="-318.89035">22dev1</tspan></text>
  <path
     style="fill-rule:evenodd;stroke:#611bb8;stroke-width:3.13902307;stroke-linecap:butt;stroke-linejoin:round"
     inkscape:connector-curvature="0"
     id="path4103-6"
     d="m 374.86796,295.32146 v 14" />
  <text
     xml:space="preserve"
     style="font-style:normal;font-weight:normal;font-size:16px;line-height:1.25;font-family:sans-serif;letter-spacing:0px;word-spacing:0px;fill:#000000;fill-opacity:1;stroke:none"
     x="315.57153"
     y="-368.90311"
     id="text4398-2"
     transform="rotate(90)"><tspan
       sodipodi:role="line"
       x="315.57153"
       y="-368.90311"
       id="tspan4400-6">22dev2</tspan></text>
  <path
     style="fill-rule:evenodd;stroke:#611bb8;stroke-width:3;stroke-linecap:butt;stroke-linejoin:round"
     inkscape:connector-curvature="0"
     id="path4107-8"
     d="m 424.88072,295.32146 v 12.78738" />
  <text
     xml:space="preserve"
     style="font-style:normal;font-weight:normal;font-size:16px;line-height:1.25;font-family:sans-serif;letter-spacing:0px;word-spacing:0px;fill:#000000;fill-opacity:1;stroke:none"
     x="315.57153"
     y="-418.91586"
     id="text4406-7"
     transform="rotate(90)"><tspan
       sodipodi:role="line"
       id="tspan4404-9"
       x="315.57153"
       y="-418.91586">22dev3</tspan></text>
  <path
     style="fill-rule:evenodd;stroke:#611bb8;stroke-width:3;stroke-linecap:butt;stroke-linejoin:round"
     inkscape:connector-curvature="0"
     id="path4111-0"
     d="m 476.44432,295.32146 v 12.78738" />
  <text
     xml:space="preserve"
     style="font-style:normal;font-weight:normal;font-size:16px;line-height:1.25;font-family:sans-serif;letter-spacing:0px;word-spacing:0px;fill:#000000;fill-opacity:1;stroke:none"
     x="315.57153"
     y="-472.03024"
     id="text4410-2"
     transform="rotate(90)"><tspan
       sodipodi:role="line"
       id="tspan4408-3"
       x="315.57153"
       y="-472.03024">22pre</tspan></text>
  <path
     style="fill-rule:evenodd;stroke:#000000;stroke-width:3;stroke-linecap:butt;stroke-linejoin:round;stroke-miterlimit:10;stroke-dasharray:none;stroke-opacity:1"
     inkscape:connector-curvature="0"
     id="path4115-5"
     d="m 524.76567,295.32146 v 12.78738" />
  <text
     xml:space="preserve"
     style="font-style:normal;font-weight:normal;font-size:16px;line-height:1.25;font-family:sans-serif;letter-spacing:0px;word-spacing:0px;fill:#000000;fill-opacity:1;stroke:none"
     x="315.57153"
     y="-518.94147"
     id="text4414-9"
     transform="rotate(90)"><tspan
       sodipodi:role="line"
       id="tspan4412-2"
       x="315.57153"
       y="-518.94147">22.0</tspan></text>
  <path
     style="fill-rule:evenodd;stroke:#000000;stroke-width:3;stroke-linecap:butt;stroke-linejoin:round;stroke-miterlimit:10;stroke-dasharray:none;stroke-opacity:1"
     inkscape:connector-curvature="0"
     id="path4119-8"
     d="m 574.77846,295.32146 v 12.78738" />
  <text
     xml:space="preserve"
     style="font-style:normal;font-weight:normal;font-size:16px;line-height:1.25;font-family:sans-serif;letter-spacing:0px;word-spacing:0px;fill:#000000;fill-opacity:1;stroke:none"
     x="315.5715"
     y="-568.95422"
     id="text4418-9"
     transform="rotate(90)"><tspan
       sodipodi:role="line"
       id="tspan4416-7"
       x="315.5715"
       y="-568.95422">22.1</tspan></text>
  <path
     style="fill-rule:evenodd;stroke:#000000;stroke-width:3;stroke-linecap:butt;stroke-linejoin:round;stroke-miterlimit:10;stroke-dasharray:none;stroke-opacity:1"
     inkscape:connector-curvature="0"
     id="path4123-6"
     d="m 624.76567,295.32146 v 12.78738" />
  <text
     xml:space="preserve"
     style="font-style:normal;font-weight:normal;font-size:16px;line-height:1.25;font-family:sans-serif;letter-spacing:0px;word-spacing:0px;fill:#000000;fill-opacity:1;stroke:none"
     x="315.57153"
     y="-618.94147"
     id="text4422-1"
     transform="rotate(90)"><tspan
       sodipodi:role="line"
       id="tspan4420-2"
       x="315.57153"
       y="-618.94147">22.2</tspan></text>
  <path
     style="fill-rule:evenodd;stroke:#000000;stroke-width:3;stroke-linecap:butt;stroke-linejoin:round;stroke-miterlimit:10;stroke-dasharray:none;stroke-opacity:1"
     inkscape:connector-curvature="0"
     id="path4127-3"
     d="m 674.80406,295.32146 v 12.78738" />
  <text
     xml:space="preserve"
     style="font-style:normal;font-weight:normal;font-size:16px;line-height:1.25;font-family:sans-serif;letter-spacing:0px;word-spacing:0px;fill:#000000;fill-opacity:1;stroke:none"
     x="315.5715"
     y="-668.97986"
     id="text4426-1"
     transform="rotate(90)"><tspan
       sodipodi:role="line"
       id="tspan4424-9"
       x="315.5715"
       y="-668.97986">22.3</tspan></text>
  <path
     style="fill:#000000;fill-opacity:0;fill-rule:evenodd;stroke:#000000;stroke-width:3;stroke-miterlimit:10;stroke-dasharray:none;stroke-opacity:1"
     inkscape:connector-curvature="0"
     id="path4117-7"
     d="m 723.04778,296.82146 v 12.78738" />
  <text
     xml:space="preserve"
     style="font-style:normal;font-weight:normal;font-size:16px;line-height:1.25;font-family:sans-serif;letter-spacing:0px;word-spacing:0px;fill:#000000;fill-opacity:1;stroke:none"
     x="315.5715"
     y="-718.99261"
     id="text4430-4"
     transform="rotate(90)"><tspan
       sodipodi:role="line"
       id="tspan4428-5"
       x="315.5715"
       y="-718.99261">22.4</tspan></text>
  <path
     style="fill-rule:evenodd;stroke:#000000;stroke-width:3;stroke-linecap:butt;stroke-linejoin:round;stroke-miterlimit:10;stroke-dasharray:none;stroke-opacity:1"
     inkscape:connector-curvature="0"
     id="path4135-3"
     d="m 774.82957,295.32146 v 12.78738" />
  <text
     xml:space="preserve"
     style="font-style:normal;font-weight:normal;font-size:16px;line-height:1.25;font-family:sans-serif;letter-spacing:0px;word-spacing:0px;fill:#000000;fill-opacity:1;stroke:none"
     x="315.57153"
     y="-769.00537"
     id="text4434-6"
     transform="rotate(90)"><tspan
       sodipodi:role="line"
       id="tspan4432-1"
       x="315.57153"
       y="-769.00537">22.5</tspan></text>
  <text
     xml:space="preserve"
     style="font-style:normal;font-weight:normal;font-size:16px;line-height:1.25;font-family:sans-serif;letter-spacing:0px;word-spacing:0px;fill:#000000;fill-opacity:1;stroke:none"
     x="315.57153"
     y="-819.01819"
     id="text4438-6"
     transform="rotate(90)"><tspan
       sodipodi:role="line"
       id="tspan4436-3"
       x="315.57153"
       y="-819.01819">22.6</tspan></text>
  <path
     style="fill-rule:evenodd;stroke:#000000;stroke-width:3;stroke-linecap:butt;stroke-linejoin:round;stroke-miterlimit:10;stroke-dasharray:none;stroke-opacity:1"
     inkscape:connector-curvature="0"
     id="path4135-6-2"
     d="m 824.84239,295.32146 v 12.78738" />
  <text
     xml:space="preserve"
     style="font-style:normal;font-weight:normal;font-size:18.66666603px;line-height:1.25;font-family:sans-serif;letter-spacing:0px;word-spacing:0px;fill:#000000;fill-opacity:1;stroke:none"
     x="202.43575"
     y="303.92877"
     id="text4472-0"><tspan
       sodipodi:role="line"
       id="tspan4470-6"
       x="202.43575"
       y="303.92877">Apertis</tspan><tspan
       sodipodi:role="line"
       x="202.43575"
       y="327.26212"
       id="tspan4474-1">2022</tspan></text>
  <path
     style="fill-rule:evenodd;stroke:#611bb8;stroke-width:3;stroke-linecap:butt;stroke-linejoin:round;stroke-miterlimit:10;stroke-dasharray:none"
     inkscape:connector-curvature="0"
     id="path4091-7"
     d="M 273.05665,308.10884 H 524.76567"
     sodipodi:nodetypes="cc" />
  <path
     style="fill:none;stroke:#000000;stroke-width:3;stroke-linecap:butt;stroke-linejoin:miter;stroke-miterlimit:10;stroke-dasharray:none;stroke-opacity:1"
     d="m 524.76567,308.10884 350.34862,0"
     id="path1005"
     inkscape:connector-curvature="0"
     sodipodi:nodetypes="cc" />
  <path
     style="fill-rule:evenodd;stroke:#611bb8;stroke-width:3;stroke-linecap:butt;stroke-linejoin:round;stroke-miterlimit:10;stroke-dasharray:none"
     inkscape:connector-curvature="0"
     id="path4091"
     d="M 68.227553,497.01767 323.15084,496.49008"
     sodipodi:nodetypes="cc" />
  <g
     id="g4700"
     transform="translate(-66.772444,163.7027)">
    <path
       d="m 144.85301,322.91995 v 12.78738"
       id="path4093"
       inkscape:connector-curvature="0"
       style="fill:#000000;fill-opacity:0;fill-rule:evenodd" />
    <path
       d="m 140,320 v 14"
       id="path4095"
       inkscape:connector-curvature="0"
       style="fill-rule:evenodd;stroke:#611bb8;stroke-width:3.13902307;stroke-linecap:butt;stroke-linejoin:round" />
    <text
       transform="rotate(90)"
       id="text4390"
       y="-134.03516"
       x="340.25006"
       style="font-style:normal;font-weight:normal;font-size:16px;line-height:1.25;font-family:sans-serif;letter-spacing:0px;word-spacing:0px;fill:#000000;fill-opacity:1;stroke:none"
       xml:space="preserve"><tspan
         y="-134.03516"
         x="340.25006"
         id="tspan4388"
         sodipodi:role="line">21dev0</tspan></text>
  </g>
  <g
     id="g4694"
     transform="translate(-66.759657,163.7027)">
    <path
       d="m 190,320 v 14"
       id="path4099"
       inkscape:connector-curvature="0"
       style="fill-rule:evenodd;stroke:#611bb8;stroke-width:3.13902307;stroke-linecap:butt;stroke-linejoin:round" />
    <text
       transform="rotate(90)"
       id="text4394"
       y="-184.03516"
       x="340.25006"
       style="font-style:normal;font-weight:normal;font-size:16px;line-height:1.25;font-family:sans-serif;letter-spacing:0px;word-spacing:0px;fill:#000000;fill-opacity:1;stroke:none"
       xml:space="preserve"><tspan
         y="-184.03516"
         x="340.25006"
         id="tspan4392"
         sodipodi:role="line">21dev1</tspan></text>
  </g>
  <g
     id="g4689"
     transform="translate(-67.74687,163.7027)">
    <path
       d="m 241,320 v 14"
       id="path4103"
       inkscape:connector-curvature="0"
       style="fill-rule:evenodd;stroke:#611bb8;stroke-width:3.13902307;stroke-linecap:butt;stroke-linejoin:round" />
    <text
       transform="rotate(90)"
       id="text4398"
       y="-235.03516"
       x="340.25006"
       style="font-style:normal;font-weight:normal;font-size:16px;line-height:1.25;font-family:sans-serif;letter-spacing:0px;word-spacing:0px;fill:#000000;fill-opacity:1;stroke:none"
       xml:space="preserve"><tspan
         id="tspan4400"
         y="-235.03516"
         x="340.25006"
         sodipodi:role="line">21dev2</tspan></text>
  </g>
  <g
     id="g4674"
     transform="translate(-66.734114,163.7027)">
    <path
       d="m 290,320 v 12.78738"
       id="path4107"
       inkscape:connector-curvature="0"
       style="fill-rule:evenodd;stroke:#611bb8;stroke-width:3;stroke-linecap:butt;stroke-linejoin:round" />
    <text
       transform="rotate(90)"
       id="text4406"
       y="-284.03516"
       x="340.25006"
       style="font-style:normal;font-weight:normal;font-size:16px;line-height:1.25;font-family:sans-serif;letter-spacing:0px;word-spacing:0px;fill:#000000;fill-opacity:1;stroke:none"
       xml:space="preserve"><tspan
         y="-284.03516"
         x="340.25006"
         id="tspan4404"
         sodipodi:role="line">21dev3</tspan></text>
  </g>
  <g
     id="g4669"
     transform="translate(-65.170515,163.7027)">
    <path
       d="m 340,320 v 12.78738"
       id="path4111"
       inkscape:connector-curvature="0"
       style="fill-rule:evenodd;stroke:#611bb8;stroke-width:3;stroke-linecap:butt;stroke-linejoin:round" />
    <text
       transform="rotate(90)"
       id="text4410"
       y="-335.58594"
       x="340.25006"
       style="font-style:normal;font-weight:normal;font-size:16px;line-height:1.25;font-family:sans-serif;letter-spacing:0px;word-spacing:0px;fill:#000000;fill-opacity:1;stroke:none"
       xml:space="preserve"><tspan
         y="-335.58594"
         x="340.25006"
         id="tspan4408"
         sodipodi:role="line">21pre</tspan></text>
  </g>
  <path
     style="fill-rule:evenodd;stroke:#000000;stroke-width:3;stroke-linecap:butt;stroke-linejoin:round;stroke-miterlimit:10;stroke-dasharray:none;stroke-opacity:1"
     inkscape:connector-curvature="0"
     id="path4115"
     d="m 323.15084,483.7027 v 12.78738" />
  <text
     xml:space="preserve"
     style="font-style:normal;font-weight:normal;font-size:16px;line-height:1.25;font-family:sans-serif;letter-spacing:0px;word-spacing:0px;fill:#000000;fill-opacity:1;stroke:none"
     x="503.95276"
     y="-317.32663"
     id="text4414"
     transform="rotate(90)"><tspan
       sodipodi:role="line"
       id="tspan4412"
       x="503.95276"
       y="-317.32663">21.0</tspan></text>
  <path
     style="fill-rule:evenodd;stroke:#000000;stroke-width:3;stroke-linecap:butt;stroke-linejoin:round;stroke-miterlimit:10;stroke-dasharray:none;stroke-opacity:1"
     inkscape:connector-curvature="0"
     id="path4119"
     d="m 373.16362,483.7027 v 12.78738" />
  <text
     xml:space="preserve"
     style="font-style:normal;font-weight:normal;font-size:16px;line-height:1.25;font-family:sans-serif;letter-spacing:0px;word-spacing:0px;fill:#000000;fill-opacity:1;stroke:none"
     x="503.95276"
     y="-367.33942"
     id="text4418"
     transform="rotate(90)"><tspan
       sodipodi:role="line"
       id="tspan4416"
       x="503.95276"
       y="-367.33942">21.1</tspan></text>
  <path
     style="fill-rule:evenodd;stroke:#000000;stroke-width:3;stroke-linecap:butt;stroke-linejoin:round;stroke-miterlimit:10;stroke-dasharray:none;stroke-opacity:1"
     inkscape:connector-curvature="0"
     id="path4123"
     d="m 423.17641,483.7027 v 12.78738" />
  <text
     xml:space="preserve"
     style="font-style:normal;font-weight:normal;font-size:16px;line-height:1.25;font-family:sans-serif;letter-spacing:0px;word-spacing:0px;fill:#000000;fill-opacity:1;stroke:none"
     x="503.95276"
     y="-417.3522"
     id="text4422"
     transform="rotate(90)"><tspan
       sodipodi:role="line"
       id="tspan4420"
       x="503.95276"
       y="-417.3522">21.2</tspan></text>
  <path
     style="fill-rule:evenodd;stroke:#000000;stroke-width:3;stroke-linecap:butt;stroke-linejoin:round;stroke-miterlimit:10;stroke-dasharray:none;stroke-opacity:1"
     inkscape:connector-curvature="0"
     id="path4127"
     d="m 473.18923,483.7027 v 12.78738" />
  <text
     xml:space="preserve"
     style="font-style:normal;font-weight:normal;font-size:16px;line-height:1.25;font-family:sans-serif;letter-spacing:0px;word-spacing:0px;fill:#000000;fill-opacity:1;stroke:none"
     x="503.95276"
     y="-467.36502"
     id="text4426"
     transform="rotate(90)"><tspan
       sodipodi:role="line"
       id="tspan4424"
       x="503.95276"
       y="-467.36502">21.3</tspan></text>
  <path
     style="fill:#000000;fill-opacity:0;fill-rule:evenodd;stroke:#000000;stroke-width:3;stroke-miterlimit:10;stroke-dasharray:none;stroke-opacity:1"
     inkscape:connector-curvature="0"
     id="path4117"
     d="m 521.43294,486.62265 v 12.78738" />
  <path
     style="fill-rule:evenodd;stroke:#000000;stroke-width:3;stroke-linecap:butt;stroke-linejoin:round;stroke-miterlimit:10;stroke-dasharray:none;stroke-opacity:1"
     inkscape:connector-curvature="0"
     id="path4131"
     d="m 523.20198,483.7027 v 12.78738" />
  <text
     xml:space="preserve"
     style="font-style:normal;font-weight:normal;font-size:16px;line-height:1.25;font-family:sans-serif;letter-spacing:0px;word-spacing:0px;fill:#000000;fill-opacity:1;stroke:none"
     x="503.95276"
     y="-517.37775"
     id="text4430"
     transform="rotate(90)"><tspan
       sodipodi:role="line"
       id="tspan4428"
       x="503.95276"
       y="-517.37775">21.4</tspan></text>
  <path
     style="fill-rule:evenodd;stroke:#000000;stroke-width:3;stroke-linecap:butt;stroke-linejoin:round;stroke-miterlimit:10;stroke-dasharray:none;stroke-opacity:1"
     inkscape:connector-curvature="0"
     id="path4135"
     d="m 573.21474,483.7027 v 12.78738" />
  <text
     xml:space="preserve"
     style="font-style:normal;font-weight:normal;font-size:16px;line-height:1.25;font-family:sans-serif;letter-spacing:0px;word-spacing:0px;fill:#000000;fill-opacity:1;stroke:none"
     x="503.95276"
     y="-567.3905"
     id="text4434"
     transform="rotate(90)"><tspan
       sodipodi:role="line"
       id="tspan4432"
       x="503.95276"
       y="-567.3905">21.5</tspan></text>
  <text
     xml:space="preserve"
     style="font-style:normal;font-weight:normal;font-size:16px;line-height:1.25;font-family:sans-serif;letter-spacing:0px;word-spacing:0px;fill:#000000;fill-opacity:1;stroke:none"
     x="503.95276"
     y="-617.40332"
     id="text4438"
     transform="rotate(90)"><tspan
       sodipodi:role="line"
       id="tspan4436"
       x="503.95276"
       y="-617.40332">21.6</tspan></text>
  <path
     style="fill-rule:evenodd;stroke:#000000;stroke-width:3;stroke-linecap:butt;stroke-linejoin:round;stroke-miterlimit:10;stroke-dasharray:none;stroke-opacity:1"
     inkscape:connector-curvature="0"
     id="path4135-6"
     d="m 623.22756,483.7027 v 12.78738" />
  <text
     xml:space="preserve"
     style="font-style:normal;font-weight:normal;font-size:18.66666603px;line-height:1.25;font-family:sans-serif;letter-spacing:0px;word-spacing:0px;fill:#000000;fill-opacity:1;stroke:none"
     x="-0.14583333"
     y="492.31"
     id="text4472"><tspan
       sodipodi:role="line"
       id="tspan4470"
       x="-0.14583333"
       y="492.31">Apertis</tspan><tspan
       sodipodi:role="line"
       x="-0.14583333"
       y="515.64331"
       id="tspan4474">2021</tspan></text>
  <path
     style="fill:none;stroke:#000000;stroke-width:3;stroke-linecap:butt;stroke-linejoin:miter;stroke-miterlimit:10;stroke-dasharray:none;stroke-opacity:1"
     d="M 323.15084,496.49008 H 674.70792"
     id="path1007"
     inkscape:connector-curvature="0"
     sodipodi:nodetypes="cc" />
  <g
     id="g1745"
     transform="translate(0,72.362169)">
    <g
       id="g4700-2-5"
       transform="translate(336.29402,-314.42501)">
      <path
         style="fill:#000000;fill-opacity:0;fill-rule:evenodd"
         inkscape:connector-curvature="0"
         id="path4093-9-5"
         d="m 144.85301,322.91995 v 12.78738" />
      <path
         style="fill-rule:evenodd;stroke:#611bb8;stroke-width:3.13902307;stroke-linecap:butt;stroke-linejoin:round"
         inkscape:connector-curvature="0"
         id="path4095-1-4"
         d="m 140,320 v 14" />
      <text
         xml:space="preserve"
         style="font-style:normal;font-weight:normal;font-size:16px;line-height:1.25;font-family:sans-serif;letter-spacing:0px;word-spacing:0px;fill:#000000;fill-opacity:1;stroke:none"
         x="340.25006"
         y="-134.03516"
         id="text4390-2-7"
         transform="rotate(90)"><tspan
           sodipodi:role="line"
           id="tspan4388-7-6"
           x="340.25006"
           y="-134.03516">23dev0</tspan></text>
    </g>
    <g
       transform="translate(336.30681,-314.42501)"
       id="g4694-0-5">
      <path
         style="fill-rule:evenodd;stroke:#611bb8;stroke-width:3.13902307;stroke-linecap:butt;stroke-linejoin:round"
         inkscape:connector-curvature="0"
         id="path4099-9-6"
         d="m 190,320 v 14" />
      <text
         xml:space="preserve"
         style="font-style:normal;font-weight:normal;font-size:16px;line-height:1.25;font-family:sans-serif;letter-spacing:0px;word-spacing:0px;fill:#000000;fill-opacity:1;stroke:none"
         x="340.25006"
         y="-184.03516"
         id="text4394-3-9"
         transform="rotate(90)"><tspan
           sodipodi:role="line"
           id="tspan4392-6-3"
           x="340.25006"
           y="-184.03516">23dev1</tspan></text>
    </g>
    <g
       transform="translate(335.31959,-314.42501)"
       id="g4689-0-7">
      <path
         style="fill-rule:evenodd;stroke:#611bb8;stroke-width:3.13902307;stroke-linecap:butt;stroke-linejoin:round"
         inkscape:connector-curvature="0"
         id="path4103-6-4"
         d="m 241,320 v 14" />
      <text
         xml:space="preserve"
         style="font-style:normal;font-weight:normal;font-size:16px;line-height:1.25;font-family:sans-serif;letter-spacing:0px;word-spacing:0px;fill:#000000;fill-opacity:1;stroke:none"
         x="340.25006"
         y="-235.03516"
         id="text4398-2-5"
         transform="rotate(90)"><tspan
           sodipodi:role="line"
           x="340.25006"
           y="-235.03516"
           id="tspan4400-6-2">23dev2</tspan></text>
    </g>
    <g
       transform="translate(336.33235,-314.42501)"
       id="g4674-1-5">
      <path
         style="fill-rule:evenodd;stroke:#611bb8;stroke-width:3;stroke-linecap:butt;stroke-linejoin:round"
         inkscape:connector-curvature="0"
         id="path4107-8-4"
         d="m 290,320 v 12.78738" />
      <text
         xml:space="preserve"
         style="font-style:normal;font-weight:normal;font-size:16px;line-height:1.25;font-family:sans-serif;letter-spacing:0px;word-spacing:0px;fill:#000000;fill-opacity:1;stroke:none"
         x="340.25006"
         y="-284.03516"
         id="text4406-7-7"
         transform="rotate(90)"><tspan
           sodipodi:role="line"
           id="tspan4404-9-4"
           x="340.25006"
           y="-284.03516">23dev3</tspan></text>
    </g>
    <g
       transform="translate(337.89595,-314.42501)"
       id="g4669-2-4">
      <path
         style="fill-rule:evenodd;stroke:#611bb8;stroke-width:3;stroke-linecap:butt;stroke-linejoin:round"
         inkscape:connector-curvature="0"
         id="path4111-0-3"
         d="m 340,320 v 12.78738" />
      <text
         xml:space="preserve"
         style="font-style:normal;font-weight:normal;font-size:16px;line-height:1.25;font-family:sans-serif;letter-spacing:0px;word-spacing:0px;fill:#000000;fill-opacity:1;stroke:none"
         x="340.25006"
         y="-335.58594"
         id="text4410-2-0"
         transform="rotate(90)"><tspan
           sodipodi:role="line"
           id="tspan4408-3-7"
           x="340.25006"
           y="-335.58594">23pre</tspan></text>
    </g>
    <path
       d="M 726.2173,5.57499 V 18.36237"
       id="path4115-5-6"
       inkscape:connector-curvature="0"
       style="fill-rule:evenodd;stroke:#000000;stroke-width:3;stroke-linecap:butt;stroke-linejoin:round;stroke-miterlimit:10;stroke-dasharray:none;stroke-opacity:1" />
    <text
       transform="rotate(90)"
       id="text4414-9-8"
       y="-720.39307"
       x="25.825047"
       style="font-style:normal;font-weight:normal;font-size:16px;line-height:1.25;font-family:sans-serif;letter-spacing:0px;word-spacing:0px;fill:#000000;fill-opacity:1;stroke:none"
       xml:space="preserve"><tspan
         y="-720.39307"
         x="25.825047"
         id="tspan4412-2-8"
         sodipodi:role="line">23.0</tspan></text>
    <path
       d="M 776.23009,5.57499 V 18.36237"
       id="path4119-8-3"
       inkscape:connector-curvature="0"
       style="fill-rule:evenodd;stroke:#000000;stroke-width:3;stroke-linecap:butt;stroke-linejoin:round;stroke-miterlimit:10;stroke-dasharray:none;stroke-opacity:1" />
    <text
       transform="rotate(90)"
       id="text4418-9-1"
       y="-770.40588"
       x="25.82505"
       style="font-style:normal;font-weight:normal;font-size:16px;line-height:1.25;font-family:sans-serif;letter-spacing:0px;word-spacing:0px;fill:#000000;fill-opacity:1;stroke:none"
       xml:space="preserve"><tspan
         y="-770.40588"
         x="25.82505"
         id="tspan4416-7-4"
         sodipodi:role="line">23.1</tspan></text>
    <path
       d="M 826.24287,5.57499 V 18.36237"
       id="path4123-6-2"
       inkscape:connector-curvature="0"
       style="fill-rule:evenodd;stroke:#000000;stroke-width:3;stroke-linecap:butt;stroke-linejoin:round;stroke-miterlimit:10;stroke-dasharray:none;stroke-opacity:1" />
    <text
       transform="rotate(90)"
       id="text4422-1-0"
       y="-820.41864"
       x="25.82505"
       style="font-style:normal;font-weight:normal;font-size:16px;line-height:1.25;font-family:sans-serif;letter-spacing:0px;word-spacing:0px;fill:#000000;fill-opacity:1;stroke:none"
       xml:space="preserve"><tspan
         y="-820.41864"
         x="25.82505"
         id="tspan4420-2-6"
         sodipodi:role="line">23.2</tspan></text>
    <text
       id="text4472-0-2"
       y="14.182291"
       x="403.88739"
       style="font-style:normal;font-weight:normal;font-size:18.66666603px;line-height:1.25;font-family:sans-serif;letter-spacing:0px;word-spacing:0px;fill:#000000;fill-opacity:1;stroke:none"
       xml:space="preserve"><tspan
         y="14.182291"
         x="403.88739"
         id="tspan4470-6-6"
         sodipodi:role="line">Apertis</tspan><tspan
         id="tspan4474-1-1"
         y="37.515625"
         x="403.88739"
         sodipodi:role="line">2023</tspan></text>
    <path
       sodipodi:nodetypes="cc"
       d="M 474.72302,18.849915 726.2173,18.36237"
       id="path4091-7-7"
       inkscape:connector-curvature="0"
       style="fill-rule:evenodd;stroke:#611bb8;stroke-width:3;stroke-linecap:butt;stroke-linejoin:round;stroke-miterlimit:10;stroke-dasharray:none" />
    <path
       d="M 873.28,18.849915 H 985.83253"
       id="path4091-7-7-9"
       inkscape:connector-curvature="0"
       style="fill-rule:evenodd;stroke:#000000;stroke-width:3;stroke-linecap:butt;stroke-linejoin:round;stroke-miterlimit:10;stroke-dasharray:6, 3;stroke-dashoffset:0;stroke-opacity:1"
       sodipodi:nodetypes="cc" />
    <path
       d="M 871.12031,5.23618 V 18.02356"
       id="path4123-6-2-7"
       inkscape:connector-curvature="0"
       style="fill-rule:evenodd;stroke:#000000;stroke-width:3;stroke-linecap:butt;stroke-linejoin:round;stroke-miterlimit:10;stroke-dasharray:none;stroke-opacity:1" />
    <text
       transform="rotate(90)"
       id="text4422-1-0-6"
       y="-865.29608"
       x="25.486237"
       style="font-style:normal;font-weight:normal;font-size:16px;line-height:1.25;font-family:sans-serif;letter-spacing:0px;word-spacing:0px;fill:#000000;fill-opacity:1;stroke:none"
       xml:space="preserve"><tspan
         y="-865.29608"
         x="25.486237"
         id="tspan4420-2-6-7"
         sodipodi:role="line">23.3</tspan></text>
    <path
       inkscape:connector-curvature="0"
       id="path1009"
       d="m 726.2173,18.36237 144.90301,-0.33881 v 0"
       style="fill:none;stroke:#000000;stroke-width:3;stroke-linecap:butt;stroke-linejoin:miter;stroke-miterlimit:10;stroke-dasharray:none;stroke-opacity:1" />
  </g>
  <path
     style="fill:#000000;fill-opacity:0;fill-rule:evenodd;stroke:none;stroke-linecap:square;stroke-miterlimit:10"
     inkscape:connector-curvature="0"
     id="path4093-9-8"
     d="m 330.88709,173.49377 v 12.78739" />
  <path
     style="fill:none;fill-rule:evenodd;stroke:#ff0000;stroke-width:3.13902307;stroke-linecap:butt;stroke-linejoin:round;stroke-miterlimit:10;stroke-opacity:1"
     inkscape:connector-curvature="0"
     id="path4095-1-1"
     d="m 478.36132,239.53771 v 14" />
  <path
     style="fill:none;fill-rule:evenodd;stroke:#000000;stroke-width:3;stroke-linecap:butt;stroke-linejoin:round;stroke-miterlimit:10;stroke-dasharray:none;stroke-opacity:1"
     inkscape:connector-curvature="0"
     id="path4115-5-3"
     d="m 673.11748,239.53771 v 12.78738" />
  <path
     style="fill:none;fill-rule:evenodd;stroke:#000000;stroke-width:3;stroke-linecap:butt;stroke-linejoin:round;stroke-miterlimit:10;stroke-dasharray:none;stroke-opacity:1"
     inkscape:connector-curvature="0"
     id="path4135-6-2-9"
     d="m 874.07108,239.53771 v 12.78738" />
  <path
     style="fill:none;fill-rule:evenodd;stroke:#ff0000;stroke-width:3;stroke-linecap:butt;stroke-linejoin:round;stroke-miterlimit:10;stroke-dasharray:none;stroke-opacity:1"
     inkscape:connector-curvature="0"
     id="path4091-7-6"
     d="m 477.9428,252.32509 195.17468,0"
     sodipodi:nodetypes="cc" />
  <path
     style="fill:none;stroke:#000000;stroke-width:3;stroke-linecap:butt;stroke-linejoin:miter;stroke-miterlimit:10;stroke-dasharray:none;stroke-opacity:1"
     d="m 673.11748,252.32509 h 200.9536"
     id="path1005-9"
     inkscape:connector-curvature="0"
     sodipodi:nodetypes="cc" />
  <text
     xml:space="preserve"
     style="font-style:normal;font-weight:normal;font-size:16px;line-height:1.25;font-family:sans-serif;letter-spacing:0px;word-spacing:0px;fill:#000000;fill-opacity:1;stroke:none"
     x="-74.513245"
     y="46.931664"
     id="text6434"><tspan
       sodipodi:role="line"
       id="tspan6432"
       x="-74.513245"
       y="61.087914" /></text>
  <text
     xml:space="preserve"
     style="font-style:normal;font-weight:normal;font-size:16px;line-height:1.25;font-family:sans-serif;letter-spacing:0px;word-spacing:0px;fill:#000000;fill-opacity:1;stroke:none"
     x="-234.05209"
     y="880.89258"
     id="text6438"
     transform="rotate(-90)"><tspan
       sodipodi:role="line"
       id="tspan6436"
       x="-234.05209"
       y="880.89258">eol</tspan></text>
  <text
     xml:space="preserve"
     style="font-style:normal;font-weight:normal;font-size:16px;line-height:1.25;font-family:sans-serif;letter-spacing:0px;word-spacing:0px;fill:#000000;fill-opacity:1;stroke:none"
     x="482.50977"
     y="235.12646"
     id="text6442"><tspan
       sodipodi:role="line"
       id="tspan6440"
       x="482.50977"
       y="235.12646">preparation</tspan></text>
  <text
     xml:space="preserve"
     style="font-style:normal;font-weight:normal;font-size:16px;line-height:1.25;font-family:sans-serif;letter-spacing:0px;word-spacing:0px;fill:#000000;fill-opacity:1;stroke:none"
     x="724.02844"
     y="232.39203"
     id="text6446"><tspan
       sodipodi:role="line"
       id="tspan6444"
       x="724.02844"
       y="232.39203">deployment</tspan></text>
  <path
     style="fill:none;fill-rule:evenodd;stroke:#ff0000;stroke-width:3.13902307;stroke-linecap:butt;stroke-linejoin:round;stroke-miterlimit:10;stroke-opacity:1"
     inkscape:connector-curvature="0"
     id="path4095-1-1-3"
     d="M 676.98887,28.055917 V 42.055913" />
  <path
     style="fill:none;fill-rule:evenodd;stroke:#000000;stroke-width:3;stroke-linecap:butt;stroke-linejoin:round;stroke-miterlimit:10;stroke-dasharray:none;stroke-opacity:1"
     inkscape:connector-curvature="0"
     id="path4115-5-3-3"
     d="M 872.90713,28.055917 V 40.843293" />
  <path
     style="fill:none;fill-rule:evenodd;stroke:#ff0000;stroke-width:3;stroke-linecap:butt;stroke-linejoin:round;stroke-miterlimit:10;stroke-dasharray:none;stroke-opacity:1"
     inkscape:connector-curvature="0"
     id="path4091-7-6-0"
     d="M 676.57035,40.843293 H 872.90713"
     sodipodi:nodetypes="cc" />
  <path
     style="fill:none;stroke:#000000;stroke-width:3;stroke-linecap:butt;stroke-linejoin:miter;stroke-miterlimit:10;stroke-dasharray:none;stroke-opacity:1"
     d="m 872.90713,40.843293 63.20661,0"
     id="path1005-9-5"
     inkscape:connector-curvature="0"
     sodipodi:nodetypes="cc" />
  <text
     xml:space="preserve"
     style="font-style:normal;font-weight:normal;font-size:16px;line-height:1.25;font-family:sans-serif;letter-spacing:0px;word-spacing:0px;fill:#000000;fill-opacity:1;stroke:none;stroke-linecap:square;stroke-miterlimit:10"
     x="681.13733"
     y="23.644676"
     id="text6442-4"><tspan
       sodipodi:role="line"
       id="tspan6440-0"
       x="681.13733"
       y="23.644676">preparation</tspan></text>
  <text
     xml:space="preserve"
     style="font-style:normal;font-weight:normal;font-size:16px;line-height:1.25;font-family:sans-serif;letter-spacing:0px;word-spacing:0px;fill:#000000;fill-opacity:1;stroke:none;stroke-linecap:square;stroke-miterlimit:10"
     x="884.16888"
     y="20.91024"
     id="text6446-0"><tspan
       sodipodi:role="line"
       id="tspan6444-4"
       x="884.16888"
       y="20.91024">deployment</tspan></text>
  <path
     style="fill:none;fill-rule:evenodd;stroke:#ff0000;stroke-width:3.13902307;stroke-linecap:butt;stroke-linejoin:round;stroke-miterlimit:10;stroke-opacity:1"
     inkscape:connector-curvature="0"
     id="path4095-1-1-6"
     d="m 278.68075,439.89878 v 14" />
  <path
     style="fill:none;fill-rule:evenodd;stroke:#000000;stroke-width:3;stroke-linecap:butt;stroke-linejoin:round;stroke-miterlimit:10;stroke-dasharray:none;stroke-opacity:1"
     inkscape:connector-curvature="0"
     id="path4115-5-3-2"
     d="m 471.50338,439.89878 v 12.78738" />
  <path
     style="fill:none;fill-rule:evenodd;stroke:#000000;stroke-width:3;stroke-linecap:butt;stroke-linejoin:round;stroke-miterlimit:10;stroke-dasharray:none;stroke-opacity:1"
     inkscape:connector-curvature="0"
     id="path4135-6-2-9-6"
     d="m 672.45698,439.89878 v 12.78738" />
  <path
     style="fill:none;fill-rule:evenodd;stroke:#ff0000;stroke-width:3;stroke-linecap:butt;stroke-linejoin:round;stroke-miterlimit:10;stroke-dasharray:none;stroke-opacity:1"
     inkscape:connector-curvature="0"
     id="path4091-7-6-7"
     d="M 278.26223,452.68616 H 471.50338"
     sodipodi:nodetypes="cc" />
  <path
     style="fill:none;stroke:#000000;stroke-width:3;stroke-linecap:butt;stroke-linejoin:miter;stroke-miterlimit:10;stroke-dasharray:none;stroke-opacity:1"
     d="m 471.50338,452.68616 200.9536,0"
     id="path1005-9-56"
     inkscape:connector-curvature="0"
     sodipodi:nodetypes="cc" />
  <text
     xml:space="preserve"
     style="font-style:normal;font-weight:normal;font-size:16px;line-height:1.25;font-family:sans-serif;letter-spacing:0px;word-spacing:0px;fill:#000000;fill-opacity:1;stroke:none;stroke-linecap:square;stroke-miterlimit:10"
     x="-434.41318"
     y="680.24524"
     id="text6438-9"
     transform="rotate(-90)"><tspan
       sodipodi:role="line"
       id="tspan6436-8"
       x="-434.41318"
       y="680.24524">eol</tspan></text>
  <text
     xml:space="preserve"
     style="font-style:normal;font-weight:normal;font-size:16px;line-height:1.25;font-family:sans-serif;letter-spacing:0px;word-spacing:0px;fill:#000000;fill-opacity:1;stroke:none;stroke-linecap:square;stroke-miterlimit:10"
     x="282.82919"
     y="435.48755"
     id="text6442-7"><tspan
       sodipodi:role="line"
       id="tspan6440-2"
       x="282.82919"
       y="435.48755">preparation</tspan></text>
  <text
     xml:space="preserve"
     style="font-style:normal;font-weight:normal;font-size:16px;line-height:1.25;font-family:sans-serif;letter-spacing:0px;word-spacing:0px;fill:#000000;fill-opacity:1;stroke:none;stroke-linecap:square;stroke-miterlimit:10"
     x="522.41431"
     y="432.75311"
     id="text6446-8"><tspan
       sodipodi:role="line"
       id="tspan6444-2"
       x="522.41431"
       y="432.75311">deployment</tspan></text>
  <text
     xml:space="preserve"
     style="font-style:normal;font-weight:normal;font-size:18.66666603px;line-height:1.25;font-family:sans-serif;letter-spacing:0px;word-spacing:0px;fill:#000000;fill-opacity:1;stroke:none"
     x="184.65257"
     y="453.31665"
     id="text6559"><tspan
       sodipodi:role="line"
       id="tspan6557"
       x="184.65257"
       y="453.31665">Product</tspan></text>
  <text
     xml:space="preserve"
     style="font-style:normal;font-weight:normal;font-size:18.66666603px;line-height:1.25;font-family:sans-serif;letter-spacing:0px;word-spacing:0px;fill:#000000;fill-opacity:1;stroke:none;stroke-linecap:square;stroke-miterlimit:10"
     x="394.04935"
     y="252.42064"
     id="text6559-9"><tspan
       sodipodi:role="line"
       id="tspan6557-9"
       x="394.04935"
       y="252.42064">Product</tspan></text>
  <text
     xml:space="preserve"
     style="font-style:normal;font-weight:normal;font-size:18.66666603px;line-height:1.25;font-family:sans-serif;letter-spacing:0px;word-spacing:0px;fill:#000000;fill-opacity:1;stroke:none;stroke-linecap:square;stroke-miterlimit:10"
     x="590.3031"
     y="41.665367"
     id="text6559-9-6"><tspan
       sodipodi:role="line"
       id="tspan6557-9-0"
       x="590.3031"
       y="41.665367">Product</tspan></text>
  <path
     d="m 936.11374,40.843293 49.66065,0"
     id="path4091-7-7-9-3"
     inkscape:connector-curvature="0"
     style="fill:none;fill-rule:evenodd;stroke:#000000;stroke-width:3;stroke-linecap:butt;stroke-linejoin:round;stroke-miterlimit:10;stroke-dasharray:6, 3;stroke-dashoffset:0;stroke-opacity:1"
     sodipodi:nodetypes="cc" />
  <path
     style="fill:none;fill-rule:evenodd;stroke:#000000;stroke-width:3;stroke-linecap:butt;stroke-linejoin:round;stroke-miterlimit:10;stroke-dasharray:none;stroke-opacity:1"
     inkscape:connector-curvature="0"
     id="path4131-6"
     d="m 673.59516,484.38518 v 12.78738" />
  <text
     xml:space="preserve"
     style="font-style:normal;font-weight:normal;font-size:16px;line-height:1.25;font-family:sans-serif;letter-spacing:0px;word-spacing:0px;fill:#000000;fill-opacity:1;stroke:none;stroke-linecap:square;stroke-miterlimit:10"
     x="502.79114"
     y="-664.87067"
     id="text4438-7"
     transform="rotate(90)"><tspan
       sodipodi:role="line"
       id="tspan4436-5"
       x="502.79114"
       y="-664.87067">21.7</tspan></text>
  <path
     style="fill:none;fill-rule:evenodd;stroke:#000000;stroke-width:3;stroke-linecap:butt;stroke-linejoin:round;stroke-miterlimit:10;stroke-dasharray:none;stroke-opacity:1"
     inkscape:connector-curvature="0"
     id="path4135-6-2-3"
     d="m 873.47432,295.14047 v 12.78738" />
  <text
     xml:space="preserve"
     style="font-style:normal;font-weight:normal;font-size:16px;line-height:1.25;font-family:sans-serif;letter-spacing:0px;word-spacing:0px;fill:#000000;fill-opacity:1;stroke:none;stroke-linecap:square;stroke-miterlimit:10"
     x="315.57153"
     y="-866.68335"
     id="text4438-6-5"
     transform="rotate(90)"><tspan
       sodipodi:role="line"
       id="tspan4436-3-6"
       x="315.57153"
       y="-866.68335">22.7</tspan></text>
</svg>
