<?xml version="1.0" encoding="UTF-8" standalone="no"?>
<!-- Created with Inkscape (http://www.inkscape.org/) -->

<svg
   xmlns:dc="http://purl.org/dc/elements/1.1/"
   xmlns:cc="http://creativecommons.org/ns#"
   xmlns:rdf="http://www.w3.org/1999/02/22-rdf-syntax-ns#"
   xmlns:svg="http://www.w3.org/2000/svg"
   xmlns="http://www.w3.org/2000/svg"
   xmlns:sodipodi="http://sodipodi.sourceforge.net/DTD/sodipodi-0.dtd"
   xmlns:inkscape="http://www.inkscape.org/namespaces/inkscape"
   width="1146.5193"
   height="378.88281"
   viewBox="0 0 303.34989 100.24608"
   version="1.1"
   id="svg8"
   inkscape:version="0.92.3 (2405546, 2018-03-11)"
   sodipodi:docname="debian_release_roadmap.svg">
  <defs
     id="defs2" />
  <sodipodi:namedview
     id="base"
     pagecolor="#ffffff"
     bordercolor="#666666"
     borderopacity="1.0"
     inkscape:pageopacity="0.0"
     inkscape:pageshadow="2"
     inkscape:zoom="1.4"
     inkscape:cx="830.44696"
     inkscape:cy="192.36197"
     inkscape:document-units="px"
     inkscape:current-layer="layer1"
     showgrid="true"
     inkscape:measure-start="170,940"
     inkscape:measure-end="130,992.857"
     inkscape:snap-to-guides="true"
     showguides="false"
     units="px"
     inkscape:window-width="3440"
     inkscape:window-height="1403"
     inkscape:window-x="0"
     inkscape:window-y="0"
     inkscape:window-maximized="1">
    <inkscape:grid
       type="xygrid"
       id="grid4518"
       originx="55.964494"
       originy="-236.74214" />
    <sodipodi:guide
       position="107.55824,52.976621"
       orientation="0,1"
       id="guide5057"
       inkscape:locked="false" />
  </sodipodi:namedview>
  <metadata
     id="metadata5">
    <rdf:RDF>
      <cc:Work
         rdf:about="">
        <dc:format>image/svg+xml</dc:format>
        <dc:type
           rdf:resource="http://purl.org/dc/dcmitype/StillImage" />
        <dc:title></dc:title>
      </cc:Work>
    </rdf:RDF>
  </metadata>
  <g
     inkscape:label="Layer 1"
     inkscape:groupmode="layer"
     id="layer1"
     transform="translate(55.964495,39.988223)">
    <g
       id="g5384">
      <path
         sodipodi:nodetypes="cc"
         inkscape:connector-curvature="0"
         id="path4520"
         d="M -18.520833,37.708326 0,37.708334"
         style="fill:none;fill-opacity:1;stroke:#9900f6;stroke-width:0.5291667;stroke-linecap:butt;stroke-linejoin:miter;stroke-miterlimit:4;stroke-dasharray:none;stroke-opacity:1" />
      <path
         sodipodi:nodetypes="cc"
         inkscape:connector-curvature="0"
         id="path4532"
         d="M 158.75,37.708326 0,37.708335"
         style="fill:none;stroke:#ff0025;stroke-width:0.5291667;stroke-linecap:butt;stroke-linejoin:miter;stroke-miterlimit:4;stroke-dasharray:none;stroke-opacity:1" />
      <text
         id="text4538"
         y="43.377972"
         x="-25.246151"
         style="font-style:normal;font-weight:normal;font-size:4.23333311px;line-height:1.25;font-family:sans-serif;letter-spacing:0px;word-spacing:0px;fill:#000000;fill-opacity:1;stroke:none;stroke-width:0.26458332"
         xml:space="preserve"><tspan
           style="stroke-width:0.26458332"
           y="43.377972"
           x="-25.246151"
           id="tspan4536"
           sodipodi:role="line">Freeze</tspan><tspan
           id="tspan4540"
           style="stroke-width:0.26458332"
           y="48.66964"
           x="-25.246151"
           sodipodi:role="line">start</tspan></text>
      <text
         id="text4544"
         y="43.508198"
         x="-8.3674479"
         style="font-style:normal;font-weight:normal;font-size:4.23333311px;line-height:1.25;font-family:sans-serif;letter-spacing:0px;word-spacing:0px;fill:#000000;fill-opacity:1;stroke:none;stroke-width:0.26458332"
         xml:space="preserve"><tspan
           style="stroke-width:0.26458332"
           y="43.508198"
           x="-8.3674479"
           id="tspan4542"
           sodipodi:role="line">Release</tspan></text>
      <text
         id="text4554"
         y="43.433781"
         x="92.956604"
         style="font-style:normal;font-weight:normal;font-size:4.23333311px;line-height:1.25;font-family:sans-serif;letter-spacing:0px;word-spacing:0px;fill:#000000;fill-opacity:1;stroke:none;stroke-width:0.26458332"
         xml:space="preserve"><tspan
           style="stroke-width:0.26458332"
           y="43.433781"
           x="92.956604"
           id="tspan4552"
           sodipodi:role="line">LTS</tspan></text>
      <path
         inkscape:connector-curvature="0"
         id="path4556"
         d="M -18.331845,37.708335 V 36.385418"
         style="fill:none;stroke:#9900f6;stroke-width:0.5291667;stroke-linecap:butt;stroke-linejoin:miter;stroke-miterlimit:4;stroke-dasharray:none;stroke-opacity:1" />
      <path
         inkscape:connector-curvature="0"
         id="path4556-3"
         d="M 0,37.708334 V 36.385417"
         style="fill:none;stroke:#ff0025;stroke-width:0.52916676;stroke-linecap:butt;stroke-linejoin:miter;stroke-miterlimit:4;stroke-dasharray:none;stroke-opacity:1" />
      <text
         id="text4575"
         y="43.433781"
         x="154.36887"
         style="font-style:normal;font-weight:normal;font-size:4.23333311px;line-height:1.25;font-family:sans-serif;letter-spacing:0px;word-spacing:0px;fill:#000000;fill-opacity:1;stroke:none;stroke-width:0.26458332"
         xml:space="preserve"><tspan
           style="stroke-width:0.26458332"
           y="43.433781"
           x="154.36887"
           id="tspan4573"
           sodipodi:role="line">EOL</tspan></text>
      <path
         inkscape:connector-curvature="0"
         id="path4556-3-7"
         d="M 158.75,37.708326 V 36.385409"
         style="fill:none;stroke:#ff0025;stroke-width:0.52916682;stroke-linecap:butt;stroke-linejoin:miter;stroke-miterlimit:4;stroke-dasharray:none;stroke-opacity:1" />
      <path
         inkscape:connector-curvature="0"
         id="path4556-3-7-6"
         d="M 95.25,37.708325 V 36.385408"
         style="fill:none;stroke:#ff0025;stroke-width:0.52916682;stroke-linecap:butt;stroke-linejoin:miter;stroke-miterlimit:4;stroke-dasharray:none;stroke-opacity:1" />
      <text
         id="text5121"
         y="36.284817"
         x="-56.507442"
         style="font-style:normal;font-weight:normal;font-size:5.64444447px;line-height:1.25;font-family:sans-serif;letter-spacing:0px;word-spacing:0px;fill:#000000;fill-opacity:1;stroke:none;stroke-width:0.26458332"
         xml:space="preserve"><tspan
           style="stroke-width:0.26458332"
           y="36.284817"
           x="-56.507442"
           id="tspan5119"
           sodipodi:role="line">Debian 9</tspan><tspan
           id="tspan5123"
           style="stroke-width:0.26458332"
           y="43.340374"
           x="-56.507442"
           sodipodi:role="line">&quot;Stretch&quot;</tspan></text>
    </g>
    <g
       id="g5749"
       transform="translate(0,-0.09117661)">
      <g
         transform="translate(0,0.66145698)"
         id="g5404">
        <path
           style="fill:none;fill-opacity:1;stroke:#9900f6;stroke-width:0.5291667;stroke-linecap:butt;stroke-linejoin:miter;stroke-miterlimit:4;stroke-dasharray:none;stroke-opacity:1"
           d="M 44.979167,13.234368 63.5,13.234376"
           id="path4520-3"
           inkscape:connector-curvature="0"
           sodipodi:nodetypes="cc" />
        <path
           style="fill:none;stroke:#ff0025;stroke-width:0.5291667;stroke-linecap:butt;stroke-linejoin:miter;stroke-miterlimit:4;stroke-dasharray:none;stroke-opacity:1"
           d="m 222.25,13.234368 -158.75,9e-6"
           id="path4532-7"
           inkscape:connector-curvature="0"
           sodipodi:nodetypes="cc" />
        <text
           xml:space="preserve"
           style="font-style:normal;font-weight:normal;font-size:4.23333311px;line-height:1.25;font-family:sans-serif;letter-spacing:0px;word-spacing:0px;fill:#000000;fill-opacity:1;stroke:none;stroke-width:0.26458332"
           x="38.253849"
           y="18.904015"
           id="text4538-4"><tspan
             sodipodi:role="line"
             id="tspan4536-5"
             x="38.253849"
             y="18.904015"
             style="stroke-width:0.26458332">Freeze</tspan><tspan
             sodipodi:role="line"
             x="38.253849"
             y="24.195681"
             style="stroke-width:0.26458332"
             id="tspan4540-2">start</tspan></text>
        <text
           xml:space="preserve"
           style="font-style:normal;font-weight:normal;font-size:4.23333311px;line-height:1.25;font-family:sans-serif;letter-spacing:0px;word-spacing:0px;fill:#000000;fill-opacity:1;stroke:none;stroke-width:0.26458332"
           x="55.132553"
           y="19.034241"
           id="text4544-5"><tspan
             sodipodi:role="line"
             id="tspan4542-4"
             x="55.132553"
             y="19.034241"
             style="stroke-width:0.26458332">Release</tspan></text>
        <text
           xml:space="preserve"
           style="font-style:normal;font-weight:normal;font-size:4.23333311px;line-height:1.25;font-family:sans-serif;letter-spacing:0px;word-spacing:0px;fill:#000000;fill-opacity:1;stroke:none;stroke-width:0.26458332"
           x="155.13368"
           y="18.959824"
           id="text4554-7"><tspan
             sodipodi:role="line"
             id="tspan4552-4"
             x="155.13368"
             y="18.959824"
             style="stroke-width:0.26458332">LTS</tspan></text>
        <path
           style="fill:none;stroke:#9900f6;stroke-width:0.5291667;stroke-linecap:butt;stroke-linejoin:miter;stroke-miterlimit:4;stroke-dasharray:none;stroke-opacity:1"
           d="M 45.168155,13.234377 V 11.91146"
           id="path4556-4"
           inkscape:connector-curvature="0" />
        <path
           style="fill:none;stroke:#ff0025;stroke-width:0.52916676;stroke-linecap:butt;stroke-linejoin:miter;stroke-miterlimit:4;stroke-dasharray:none;stroke-opacity:1"
           d="M 63.5,13.234376 V 11.911459"
           id="path4556-3-3"
           inkscape:connector-curvature="0" />
        <text
           xml:space="preserve"
           style="font-style:normal;font-weight:normal;font-size:4.23333311px;line-height:1.25;font-family:sans-serif;letter-spacing:0px;word-spacing:0px;fill:#000000;fill-opacity:1;stroke:none;stroke-width:0.26458332"
           x="217.86887"
           y="18.959824"
           id="text4575-0"><tspan
             sodipodi:role="line"
             id="tspan4573-7"
             x="217.86887"
             y="18.959824"
             style="stroke-width:0.26458332">EOL</tspan></text>
        <path
           style="fill:none;stroke:#ff0025;stroke-width:0.52916682;stroke-linecap:butt;stroke-linejoin:miter;stroke-miterlimit:4;stroke-dasharray:none;stroke-opacity:1"
           d="M 222.25,13.234368 V 11.911451"
           id="path4556-3-7-8"
           inkscape:connector-curvature="0" />
        <path
           style="fill:none;stroke:#ff0025;stroke-width:0.52916682;stroke-linecap:butt;stroke-linejoin:miter;stroke-miterlimit:4;stroke-dasharray:none;stroke-opacity:1"
           d="M 158.75,13.234368 V 11.911451"
           id="path4556-3-7-6-6"
           inkscape:connector-curvature="0" />
        <text
           xml:space="preserve"
           style="font-style:normal;font-weight:normal;font-size:5.64444447px;line-height:1.25;font-family:sans-serif;letter-spacing:0px;word-spacing:0px;fill:#000000;fill-opacity:1;stroke:none;stroke-width:0.26458332"
           x="3.9687514"
           y="11.810859"
           id="text5127"><tspan
             sodipodi:role="line"
             id="tspan5125"
             x="3.9687514"
             y="11.810859"
             style="stroke-width:0.26458332">Debian 10</tspan><tspan
             sodipodi:role="line"
             x="3.9687514"
             y="18.866415"
             style="stroke-width:0.26458332"
             id="tspan5129">&quot;Buster&quot;</tspan></text>
      </g>
    </g>
    <path
       style="fill:none;fill-opacity:1;stroke:#9900f6;stroke-width:0.5291667;stroke-linecap:butt;stroke-linejoin:miter;stroke-miterlimit:4;stroke-dasharray:none;stroke-opacity:1"
       d="m 108.47917,-9.9166831 18.52083,8e-6"
       id="path4520-3-8"
       inkscape:connector-curvature="0"
       sodipodi:nodetypes="cc" />
    <path
       style="fill:none;stroke:#ff0025;stroke-width:0.5291667;stroke-linecap:butt;stroke-linejoin:miter;stroke-miterlimit:4;stroke-dasharray:none;stroke-opacity:1"
       d="M 226.21875,-9.9166751 127,-9.9166661"
       id="path4532-7-4"
       inkscape:connector-curvature="0"
       sodipodi:nodetypes="cc" />
    <text
       xml:space="preserve"
       style="font-style:normal;font-weight:normal;font-size:4.23333311px;line-height:1.25;font-family:sans-serif;letter-spacing:0px;word-spacing:0px;fill:#000000;fill-opacity:1;stroke:none;stroke-width:0.26458332"
       x="101.75385"
       y="-4.1558518"
       id="text4538-4-3"><tspan
         sodipodi:role="line"
         id="tspan4536-5-1"
         x="101.75385"
         y="-4.1558518"
         style="stroke-width:0.26458332">Freeze</tspan><tspan
         sodipodi:role="line"
         x="101.75385"
         y="1.1358145"
         style="stroke-width:0.26458332"
         id="tspan4540-2-4">start</tspan></text>
    <text
       xml:space="preserve"
       style="font-style:normal;font-weight:normal;font-size:4.23333311px;line-height:1.25;font-family:sans-serif;letter-spacing:0px;word-spacing:0px;fill:#000000;fill-opacity:1;stroke:none;stroke-width:0.26458332"
       x="118.63255"
       y="-4.0256257"
       id="text4544-5-9"><tspan
         sodipodi:role="line"
         id="tspan4542-4-2"
         x="118.63255"
         y="-4.0256257"
         style="stroke-width:0.26458332">Release</tspan></text>
    <text
       xml:space="preserve"
       style="font-style:normal;font-weight:normal;font-size:4.23333311px;line-height:1.25;font-family:sans-serif;letter-spacing:0px;word-spacing:0px;fill:#000000;fill-opacity:1;stroke:none;stroke-width:0.26458332"
       x="218.63368"
       y="-4.1000428"
       id="text4554-7-0"><tspan
         sodipodi:role="line"
         id="tspan4552-4-6"
         x="218.63368"
         y="-4.1000428"
         style="stroke-width:0.26458332">LTS</tspan></text>
    <path
       style="fill:none;stroke:#9900f6;stroke-width:0.5291667;stroke-linecap:butt;stroke-linejoin:miter;stroke-miterlimit:4;stroke-dasharray:none;stroke-opacity:1"
       d="M 108.66816,-9.8254895 V -11.148406"
       id="path4556-4-8"
       inkscape:connector-curvature="0" />
    <path
       style="fill:none;stroke:#ff0025;stroke-width:0.52916676;stroke-linecap:butt;stroke-linejoin:miter;stroke-miterlimit:4;stroke-dasharray:none;stroke-opacity:1"
       d="M 127,-9.8254905 V -11.148407"
       id="path4556-3-3-9"
       inkscape:connector-curvature="0" />
    <path
       style="fill:none;stroke:#ff0025;stroke-width:0.52916682;stroke-linecap:butt;stroke-linejoin:miter;stroke-miterlimit:4;stroke-dasharray:none;stroke-opacity:1"
       d="M 222.25,-9.8254985 V -11.148415"
       id="path4556-3-7-6-6-4"
       inkscape:connector-curvature="0" />
    <text
       xml:space="preserve"
       style="font-style:normal;font-weight:normal;font-size:5.64444447px;line-height:1.25;font-family:sans-serif;letter-spacing:0px;word-spacing:0px;fill:#000000;fill-opacity:1;stroke:none;stroke-width:0.26458332"
       x="67.657745"
       y="-11.796088"
       id="text5133"><tspan
         sodipodi:role="line"
         id="tspan5131"
         x="67.657745"
         y="-11.796088"
         style="stroke-width:0.26458332">Debian 11</tspan><tspan
         sodipodi:role="line"
         x="67.657745"
         y="-4.7405329"
         style="stroke-width:0.26458332"
         id="tspan5135">&quot;Bullseye&quot;</tspan></text>
           <text
       xml:space="preserve"
       style="font-style:normal;font-weight:normal;font-size:4.23333311px;line-height:1.25;font-family:sans-serif;letter-spacing:0px;word-spacing:0px;fill:#000000;fill-opacity:1;stroke:none;stroke-width:0.26458332"
       x="-5.0994306"
       y="54.906242"
       id="text5192"><tspan
         sodipodi:role="line"
         id="tspan5190"
         x="-5.0994306"
         y="54.906242"
         style="stroke-width:0.26458332">June</tspan><tspan
         sodipodi:role="line"
         x="-5.0994306"
         y="60.19791"
         style="stroke-width:0.26458332"
         id="tspan5206">2017</tspan></text>
    <text
       xml:space="preserve"
       style="font-style:normal;font-weight:normal;font-size:4.23333311px;line-height:1.25;font-family:sans-serif;letter-spacing:0px;word-spacing:0px;fill:#000000;fill-opacity:1;stroke:none;stroke-width:0.26458332"
       x="57.070419"
       y="54.906242"
       id="text5196"><tspan
         sodipodi:role="line"
         id="tspan5194"
         x="57.070419"
         y="54.906242"
         style="stroke-width:0.26458332">~June</tspan><tspan
         sodipodi:role="line"
         x="57.070419"
         y="60.19791"
         style="stroke-width:0.26458332"
         id="tspan5198">2019</tspan></text>
    <text
       xml:space="preserve"
       style="font-style:normal;font-weight:normal;font-size:4.23333311px;line-height:1.25;font-family:sans-serif;letter-spacing:0px;word-spacing:0px;fill:#000000;fill-opacity:1;stroke:none;stroke-width:0.26458332"
       x="120.57042"
       y="54.906242"
       id="text5202"><tspan
         sodipodi:role="line"
         id="tspan5200"
         x="120.57042"
         y="54.906242"
         style="stroke-width:0.26458332">~June</tspan><tspan
         sodipodi:role="line"
         x="120.57042"
         y="60.19791"
         style="stroke-width:0.26458332"
         id="tspan5204">2021</tspan></text>
    <text
       xml:space="preserve"
       style="font-style:normal;font-weight:normal;font-size:4.23333311px;line-height:1.25;font-family:sans-serif;letter-spacing:0px;word-spacing:0px;fill:#000000;fill-opacity:1;stroke:none;stroke-width:0.26458332"
       x="40.036686"
       y="54.906242"
       id="text5210"><tspan
         sodipodi:role="line"
         id="tspan5208"
         x="40.036686"
         y="54.906242"
         style="stroke-width:0.26458332">Jan</tspan><tspan
         sodipodi:role="line"
         x="40.036686"
         y="60.19791"
         style="stroke-width:0.26458332"
         id="tspan5212">2019</tspan></text>
    <text
       xml:space="preserve"
       style="font-style:normal;font-weight:normal;font-size:4.23333311px;line-height:1.25;font-family:sans-serif;letter-spacing:0px;word-spacing:0px;fill:#000000;fill-opacity:1;stroke:none;stroke-width:0.26458332"
       x="103.31862"
       y="54.906242"
       id="text5216"><tspan
         sodipodi:role="line"
         x="103.31862"
         y="54.906242"
         style="stroke-width:0.26458332"
         id="tspan5218">~Jan </tspan><tspan
         sodipodi:role="line"
         x="103.31862"
         y="60.19791"
         style="stroke-width:0.26458332"
         id="tspan5228">2021</tspan></text>
    <text
       xml:space="preserve"
       style="font-style:normal;font-weight:normal;font-size:4.23333311px;line-height:1.25;font-family:sans-serif;letter-spacing:0px;word-spacing:0px;fill:#000000;fill-opacity:1;stroke:none;stroke-width:0.26458332"
       x="-23.431276"
       y="54.906242"
       id="text5224"><tspan
         sodipodi:role="line"
         id="tspan5222"
         x="-23.431276"
         y="54.906242"
         style="stroke-width:0.26458332">Jan.</tspan><tspan
         sodipodi:role="line"
         x="-23.431276"
         y="60.19791"
         style="stroke-width:0.26458332"
         id="tspan5226">2017</tspan></text>
           <text
       xml:space="preserve"
       style="font-style:normal;font-weight:normal;font-size:4.23333311px;line-height:1.25;font-family:sans-serif;letter-spacing:0px;word-spacing:0px;fill:#000000;fill-opacity:1;stroke:none;stroke-width:0.26458332"
       x="152.32042"
       y="54.906242"
       id="text5202-9"><tspan
         sodipodi:role="line"
         id="tspan5200-5"
         x="152.32042"
         y="54.906242"
         style="stroke-width:0.26458332">~June</tspan><tspan
         sodipodi:role="line"
         x="152.32042"
         y="60.19791"
         style="stroke-width:0.26458332"
         id="tspan5204-0">2022</tspan></text>
    <text
       xml:space="preserve"
       style="font-style:normal;font-weight:normal;font-size:4.23333311px;line-height:1.25;font-family:sans-serif;letter-spacing:0px;word-spacing:0px;fill:#000000;fill-opacity:1;stroke:none;stroke-width:0.26458332"
       x="215.82042"
       y="54.906242"
       id="text5202-9-4"><tspan
         sodipodi:role="line"
         id="tspan5200-5-8"
         x="215.82042"
         y="54.906242"
         style="stroke-width:0.26458332">~June</tspan><tspan
         sodipodi:role="line"
         x="215.82042"
         y="60.19791"
         style="stroke-width:0.26458332"
         id="tspan5204-0-7">2024</tspan></text>
    <g
       id="g5711">
      <path
         sodipodi:nodetypes="cc"
         inkscape:connector-curvature="0"
         id="path4520-3-8-1"
         d="m 171.97917,-33.729175 18.52083,8e-6"
         style="fill:none;fill-opacity:1;stroke:#9900f6;stroke-width:0.52916664;stroke-linecap:butt;stroke-linejoin:miter;stroke-miterlimit:4;stroke-dasharray:none;stroke-opacity:1" />
      <path
         sodipodi:nodetypes="cc"
         inkscape:connector-curvature="0"
         id="path4532-7-4-7"
         d="m 226.21875,-33.729175 -35.71875,9e-6"
         style="fill:none;stroke:#ff0025;stroke-width:0.52916664;stroke-linecap:butt;stroke-linejoin:miter;stroke-miterlimit:4;stroke-dasharray:none;stroke-opacity:1" />
      <text
         id="text4538-4-3-2"
         y="-28.059528"
         x="165.25385"
         style="font-style:normal;font-weight:normal;font-size:4.23333311px;line-height:1.25;font-family:sans-serif;letter-spacing:0px;word-spacing:0px;fill:#000000;fill-opacity:1;stroke:none;stroke-width:0.26458332"
         xml:space="preserve"><tspan
           style="stroke-width:0.26458332"
           y="-28.059528"
           x="165.25385"
           id="tspan4536-5-1-7"
           sodipodi:role="line">Freeze</tspan><tspan
           id="tspan4540-2-4-2"
           style="stroke-width:0.26458332"
           y="-22.767862"
           x="165.25385"
           sodipodi:role="line">start</tspan></text>
      <text
         id="text4544-5-9-2"
         y="-27.929302"
         x="182.13254"
         style="font-style:normal;font-weight:normal;font-size:4.23333311px;line-height:1.25;font-family:sans-serif;letter-spacing:0px;word-spacing:0px;fill:#000000;fill-opacity:1;stroke:none;stroke-width:0.26458332"
         xml:space="preserve"><tspan
           style="stroke-width:0.26458332"
           y="-27.929302"
           x="182.13254"
           id="tspan4542-4-2-6"
           sodipodi:role="line">Release</tspan></text>
      <path
         inkscape:connector-curvature="0"
         id="path4556-4-8-6"
         d="m 172.16816,-33.729166 v -1.322917"
         style="fill:none;stroke:#9900f6;stroke-width:0.52916664;stroke-linecap:butt;stroke-linejoin:miter;stroke-miterlimit:4;stroke-dasharray:none;stroke-opacity:1" />
      <path
         inkscape:connector-curvature="0"
         id="path4556-3-3-9-1"
         d="m 190.5,-33.729167 v -1.322917"
         style="fill:none;stroke:#ff0025;stroke-width:0.52916676;stroke-linecap:butt;stroke-linejoin:miter;stroke-miterlimit:4;stroke-dasharray:none;stroke-opacity:1" />
      <text
         id="text5133-0"
         y="-35.699768"
         x="125.48812"
         style="font-style:normal;font-weight:normal;font-size:5.64444447px;line-height:1.25;font-family:sans-serif;letter-spacing:0px;word-spacing:0px;fill:#000000;fill-opacity:1;stroke:none;stroke-width:0.26458332"
         xml:space="preserve"><tspan
           style="stroke-width:0.26458332"
           y="-35.699768"
           x="125.48812"
           id="tspan5131-9"
           sodipodi:role="line">Debian 12</tspan><tspan
           id="tspan5135-1"
           style="stroke-width:0.26458332"
           y="-28.644213"
           x="125.48812"
           sodipodi:role="line">&quot;Bookworm&quot;</tspan></text>
    </g>
    <text
       xml:space="preserve"
       style="font-style:normal;font-weight:normal;font-size:4.23333311px;line-height:1.25;font-family:sans-serif;letter-spacing:0px;word-spacing:0px;fill:#000000;fill-opacity:1;stroke:none;stroke-width:0.26458332"
       x="184.07042"
       y="54.906242"
       id="text5202-6"><tspan
         sodipodi:role="line"
         id="tspan5200-3"
         x="184.07042"
         y="54.906242"
         style="stroke-width:0.26458332">~June</tspan><tspan
         sodipodi:role="line"
         x="184.07042"
         y="60.19791"
         style="stroke-width:0.26458332"
         id="tspan5204-8">2023</tspan></text>
    <text
       xml:space="preserve"
       style="font-style:normal;font-weight:normal;font-size:4.23333311px;line-height:1.25;font-family:sans-serif;letter-spacing:0px;word-spacing:0px;fill:#000000;fill-opacity:1;stroke:none;stroke-width:0.26458332"
       x="166.79277"
       y="54.906242"
       id="text5216-5"><tspan
         sodipodi:role="line"
         x="166.79277"
         y="54.906242"
         style="stroke-width:0.26458332"
         id="tspan5218-6">~Jan </tspan><tspan
         sodipodi:role="line"
         x="166.79277"
         y="60.19791"
         style="stroke-width:0.26458332"
         id="tspan5228-1">2023</tspan></text>
    <path
       style="fill:none;stroke:#ff0025;stroke-width:0.5291667;stroke-linecap:butt;stroke-linejoin:miter;stroke-miterlimit:4;stroke-dasharray:1.05833334, 0.52916667;stroke-dashoffset:0;stroke-opacity:1"
       d="m 226.21875,-9.916675 h 21.16666"
       id="path5751"
       inkscape:connector-curvature="0" />
    <path
       style="fill:none;stroke:#ff0025;stroke-width:0.52916664;stroke-linecap:butt;stroke-linejoin:miter;stroke-miterlimit:4;stroke-dasharray:1.05833333, 0.52916666;stroke-dashoffset:0;stroke-opacity:1"
       d="m 226.21875,-33.729175 h 21.16666"
       id="path5751-1"
       inkscape:connector-curvature="0" />
  </g>
</svg>
