<?xml version="1.0" encoding="UTF-8" standalone="no"?>
<!DOCTYPE svg PUBLIC "-//W3C//DTD SVG 1.0//EN" "http://www.w3.org/TR/2001/PR-SVG-20010719/DTD/svg10.dtd">
<svg width="53cm" height="27cm" viewBox="99 19 1043 523" xmlns="http://www.w3.org/2000/svg" xmlns:xlink="http://www.w3.org/1999/xlink">
  <g>
    <g>
      <rect style="fill: #ffc0cb" x="140" y="20" width="300" height="220"/>
      <rect style="fill: none; fill-opacity:0; stroke-width: 2; stroke: #000000" x="140" y="20" width="300" height="220"/>
    </g>
    <line style="fill: none; fill-opacity:0; stroke-width: 2; stroke: #000000" x1="140" y1="40" x2="440" y2="40"/>
    <line style="fill: none; fill-opacity:0; stroke-width: 2; stroke: #000000" x1="420" y1="40" x2="420" y2="20"/>
    <line style="fill: none; fill-opacity:0; stroke-width: 2; stroke: #000000" x1="400" y1="40" x2="400" y2="20"/>
    <line style="fill: none; fill-opacity:0; stroke-width: 2; stroke: #000000" x1="380" y1="40" x2="380" y2="20"/>
  </g>
  <g>
    <rect style="fill: #add8e6" x="540" y="120" width="380" height="100"/>
    <rect style="fill: none; fill-opacity:0; stroke-width: 2; stroke: #000000" x="540" y="120" width="380" height="100"/>
  </g>
  <g>
    <rect style="fill: #bfbfbf" x="540" y="280" width="160" height="100"/>
    <rect style="fill: none; fill-opacity:0; stroke-width: 2; stroke: #000000" x="540" y="280" width="160" height="100"/>
  </g>
  <g>
    <rect style="fill: #bfbfbf" x="760" y="280" width="160" height="100"/>
    <rect style="fill: none; fill-opacity:0; stroke-width: 2; stroke: #000000" x="760" y="280" width="160" height="100"/>
  </g>
  <g>
    <rect style="fill: #bfbfbf" x="980" y="280" width="160" height="100"/>
    <rect style="fill: none; fill-opacity:0; stroke-width: 2; stroke: #000000" x="980" y="280" width="160" height="100"/>
  </g>
  <g>
    <line style="fill: none; fill-opacity:0; stroke-width: 2; stroke: #bfbfbf" x1="620" y1="224.472" x2="620" y2="275.528"/>
    <polyline style="fill: none; fill-opacity:0; stroke-width: 2; stroke: #bfbfbf" points="625,232.236 620,222.236 615,232.236 "/>
    <polyline style="fill: none; fill-opacity:0; stroke-width: 2; stroke: #bfbfbf" points="615,267.764 620,277.764 625,267.764 "/>
  </g>
  <g>
    <line style="fill: none; fill-opacity:0; stroke-width: 2; stroke: #bfbfbf" x1="840" y1="224.472" x2="840" y2="275.528"/>
    <polyline style="fill: none; fill-opacity:0; stroke-width: 2; stroke: #bfbfbf" points="845,232.236 840,222.236 835,232.236 "/>
    <polyline style="fill: none; fill-opacity:0; stroke-width: 2; stroke: #bfbfbf" points="835,267.764 840,277.764 845,267.764 "/>
  </g>
  <g>
    <line style="fill: none; fill-opacity:0; stroke-width: 2; stroke: #bfbfbf" x1="700" y1="330" x2="755.528" y2="330"/>
    <polyline style="fill: none; fill-opacity:0; stroke-width: 2; stroke: #bfbfbf" points="747.764,335 757.764,330 747.764,325 "/>
  </g>
  <g>
    <line style="fill: none; fill-opacity:0; stroke-width: 2; stroke: #bfbfbf" x1="920" y1="330" x2="975.528" y2="330"/>
    <polyline style="fill: none; fill-opacity:0; stroke-width: 2; stroke: #bfbfbf" points="967.764,335 977.764,330 967.764,325 "/>
  </g>
  <text font-size="12.8" style="fill: #000000;text-anchor:middle;font-family:sans-serif;font-style:normal;font-weight:normal" x="1060" y="334.45">
    <tspan x="1060" y="334.45">Screen</tspan>
  </text>
  <text font-size="12.8" style="fill: #000000;text-anchor:middle;font-family:sans-serif;font-style:normal;font-weight:normal" x="840" y="334.45">
    <tspan x="840" y="334.45">Display controller</tspan>
  </text>
  <text font-size="12.8" style="fill: #000000;text-anchor:middle;font-family:sans-serif;font-style:normal;font-weight:normal" x="620" y="334.45">
    <tspan x="620" y="334.45">GPU</tspan>
  </text>
  <text font-size="12.8" style="fill: #000000;text-anchor:middle;font-family:sans-serif;font-style:normal;font-weight:normal" x="730" y="174.45">
    <tspan x="730" y="174.45">Graphics memory</tspan>
  </text>
  <g>
    <g>
      <rect style="fill: #e6e6fa" x="120" y="60" width="300" height="220"/>
      <rect style="fill: none; fill-opacity:0; stroke-width: 2; stroke: #000000" x="120" y="60" width="300" height="220"/>
    </g>
    <line style="fill: none; fill-opacity:0; stroke-width: 2; stroke: #000000" x1="120" y1="80" x2="420" y2="80"/>
    <line style="fill: none; fill-opacity:0; stroke-width: 2; stroke: #000000" x1="400" y1="80" x2="400" y2="60"/>
    <line style="fill: none; fill-opacity:0; stroke-width: 2; stroke: #000000" x1="380" y1="80" x2="380" y2="60"/>
    <line style="fill: none; fill-opacity:0; stroke-width: 2; stroke: #000000" x1="360" y1="80" x2="360" y2="60"/>
  </g>
  <text font-size="56.4444" style="fill: #000000;text-anchor:middle;font-family:sans-serif;font-style:normal;font-weight:normal" x="280" y="439.55">
    <tspan x="280" y="439.55">2</tspan>
  </text>
  <g>
    <g>
      <rect style="fill: #ffff84" x="100" y="100" width="300" height="220"/>
      <rect style="fill: none; fill-opacity:0; stroke-width: 2; stroke: #000000" x="100" y="100" width="300" height="220"/>
    </g>
    <line style="fill: none; fill-opacity:0; stroke-width: 2; stroke: #000000" x1="100" y1="120" x2="400" y2="120"/>
    <line style="fill: none; fill-opacity:0; stroke-width: 2; stroke: #000000" x1="380" y1="120" x2="380" y2="100"/>
    <line style="fill: none; fill-opacity:0; stroke-width: 2; stroke: #000000" x1="360" y1="120" x2="360" y2="100"/>
    <line style="fill: none; fill-opacity:0; stroke-width: 2; stroke: #000000" x1="340" y1="120" x2="340" y2="100"/>
  </g>
  <text font-size="56.4444" style="fill: #000000;text-anchor:middle;font-family:sans-serif;font-style:normal;font-weight:normal" x="240" y="379.55">
    <tspan x="240" y="379.55">1</tspan>
  </text>
  <g>
    <rect style="fill: #e17de5" x="380" y="440" width="100" height="100"/>
    <rect style="fill: none; fill-opacity:0; stroke-width: 2; stroke: #000000" x="380" y="440" width="100" height="100"/>
  </g>
  <text font-size="12.8" style="fill: #000000;text-anchor:middle;font-family:sans-serif;font-style:normal;font-weight:normal" x="430" y="494.45">
    <tspan x="430" y="494.45">Video</tspan>
  </text>
  <g>
    <path style="fill: none; fill-opacity:0; stroke-width: 2; stroke: #000000" d="M 400 210 C 460,190 460,200 530.884,173.419"/>
    <polygon style="fill: #000000" points="537.906,170.785 530.299,178.978 530.884,173.419 526.787,169.615 "/>
    <polygon style="fill: none; fill-opacity:0; stroke-width: 2; stroke: #000000" points="537.906,170.785 530.299,178.978 530.884,173.419 526.787,169.615 "/>
  </g>
  <g>
    <path style="fill: none; fill-opacity:0; stroke-width: 2; stroke: #000000" d="M 530.489,157.963 A 191.679,191.679 0 0 0 420,170"/>
    <polygon style="fill: #000000" points="537.826,159.476 526.933,161.996 530.535,157.72 529.275,152.274 "/>
    <polygon style="fill: none; fill-opacity:0; stroke-width: 2; stroke: #000000" points="537.826,159.476 526.933,161.996 530.535,157.72 529.275,152.274 "/>
  </g>
  <g>
    <path style="fill: none; fill-opacity:0; stroke-width: 2; stroke: #000000" d="M 260 360 C 400,380 480,280 534.991,188.349"/>
    <polygon style="fill: #000000" points="538.85,181.917 537.992,193.065 534.991,188.349 529.417,187.92 "/>
    <polygon style="fill: none; fill-opacity:0; stroke-width: 2; stroke: #000000" points="538.85,181.917 537.992,193.065 534.991,188.349 529.417,187.92 "/>
  </g>
  <g>
    <path style="fill: none; fill-opacity:0; stroke-width: 2; stroke: #000000" d="M 300 420 C 379.68,420 480,300 534.991,208.349"/>
    <polygon style="fill: #000000" points="538.85,201.917 537.992,213.065 534.991,208.349 529.417,207.92 "/>
    <polygon style="fill: none; fill-opacity:0; stroke-width: 2; stroke: #000000" points="538.85,201.917 537.992,213.065 534.991,208.349 529.417,207.92 "/>
  </g>
  <g>
    <path style="fill: none; fill-opacity:0; stroke-width: 2; stroke: #000000" d="M 430 440 C 470,380 500,300 535.646,228.708"/>
    <polygon style="fill: #000000" points="539,222 539,233.18 535.646,228.708 530.056,228.708 "/>
    <polygon style="fill: none; fill-opacity:0; stroke-width: 2; stroke: #000000" points="539,222 539,233.18 535.646,228.708 530.056,228.708 "/>
  </g>
  <text font-size="56.4444" style="fill: #000000;text-anchor:middle;font-family:sans-serif;font-style:normal;font-weight:normal" x="340" y="479.55">
    <tspan x="340" y="479.55">3</tspan>
  </text>
  <text font-size="12.8" style="fill: #000000;text-anchor:start;font-family:sans-serif;font-style:normal;font-weight:normal" x="340" y="460">
    <tspan x="340" y="460"></tspan>
  </text>
  <g>
    <path style="fill: none; fill-opacity:0; stroke-width: 2; stroke: #000000" d="M 360 440 C 420,400 480,300 534.158,227.789"/>
    <polygon style="fill: #000000" points="538.658,221.789 536.658,232.789 534.158,227.789 528.658,226.789 "/>
    <polygon style="fill: none; fill-opacity:0; stroke-width: 2; stroke: #000000" points="538.658,221.789 536.658,232.789 534.158,227.789 528.658,226.789 "/>
  </g>
</svg>
