<?xml version="1.0" encoding="utf-8"?>
<!-- Generator: Adobe Illustrator 25.0.1, SVG Export Plug-In . SVG Version: 6.00 Build 0)  -->
<svg version="1.1" id="Layer_1" xmlns="http://www.w3.org/2000/svg" xmlns:xlink="http://www.w3.org/1999/xlink" x="0px" y="0px"
	 viewBox="0 0 32.03 22.77" style="enable-background:new 0 0 32.03 22.77;" xml:space="preserve">
<style type="text/css">
	.st0{fill:#3A5A80;}
</style>
<g>
	
		<rect x="1.25" y="9.97" transform="matrix(0.7071 0.7071 -0.7071 0.7071 12.7396 -7.9894)" class="st0" width="29.53" height="2.83"/>
	
		<rect x="1.25" y="9.97" transform="matrix(0.7071 -0.7071 0.7071 0.7071 -3.3589 14.6577)" class="st0" width="29.53" height="2.83"/>
</g>
</svg>
