<?xml version="1.0" encoding="UTF-8" standalone="no"?>
<!-- Created with Inkscape (http://www.inkscape.org/) -->

<svg
   xmlns:dc="http://purl.org/dc/elements/1.1/"
   xmlns:cc="http://creativecommons.org/ns#"
   xmlns:rdf="http://www.w3.org/1999/02/22-rdf-syntax-ns#"
   xmlns:svg="http://www.w3.org/2000/svg"
   xmlns="http://www.w3.org/2000/svg"
   xmlns:sodipodi="http://sodipodi.sourceforge.net/DTD/sodipodi-0.dtd"
   xmlns:inkscape="http://www.inkscape.org/namespaces/inkscape"
   width="228.45087mm"
   height="249.67039mm"
   viewBox="0 0 228.45087 249.67039"
   version="1.1"
   id="svg8"
   inkscape:version="0.92.4 5da689c313, 2019-01-14"
   sodipodi:docname="apertis-application-framework-layers.svg">
  <defs
     id="defs2" />
  <sodipodi:namedview
     id="base"
     pagecolor="#ffffff"
     bordercolor="#666666"
     borderopacity="1.0"
     inkscape:pageopacity="0.0"
     inkscape:pageshadow="2"
     inkscape:zoom="1.4"
     inkscape:cx="207.86978"
     inkscape:cy="480.77543"
     inkscape:document-units="mm"
     inkscape:current-layer="layer1"
     showgrid="false"
     inkscape:window-width="3840"
     inkscape:window-height="2018"
     inkscape:window-x="0"
     inkscape:window-y="68"
     inkscape:window-maximized="1"
     fit-margin-top="2.5"
     fit-margin-left="2.5"
     fit-margin-bottom="2.5"
     fit-margin-right="2.5" />
  <metadata
     id="metadata5">
    <rdf:RDF>
      <cc:Work
         rdf:about="">
        <dc:format>image/svg+xml</dc:format>
        <dc:type
           rdf:resource="http://purl.org/dc/dcmitype/StillImage" />
        <dc:title></dc:title>
      </cc:Work>
    </rdf:RDF>
  </metadata>
  <g
     inkscape:label="Livello 1"
     inkscape:groupmode="layer"
     id="layer1"
     transform="translate(3.6917801,-10.243881)">
    <rect
       style="opacity:1;vector-effect:none;fill:#ffffff;fill-opacity:1;stroke:#266ad6;stroke-width:0.94898325;stroke-linecap:butt;stroke-linejoin:miter;stroke-miterlimit:4;stroke-dasharray:none;stroke-dashoffset:0;stroke-opacity:1"
       id="rect1865-3-8-8-0"
       width="222.50188"
       height="28.597853"
       x="-0.71728843"
       y="228.34193"
       rx="6.7468748"
       ry="0.088589646" />
    <text
       xml:space="preserve"
       style="font-style:normal;font-weight:normal;font-size:3.52777767px;line-height:1.25;font-family:sans-serif;letter-spacing:0px;word-spacing:0px;fill:#000000;fill-opacity:1;stroke:none;stroke-width:0.26458332"
       x="11.400499"
       y="234.965"
       id="text1304-9"><tspan
         sodipodi:role="line"
         id="tspan1302-6"
         x="11.400499"
         y="234.965"
         style="stroke-width:0.26458332">Kernel</tspan></text>
    <rect
       style="opacity:1;vector-effect:none;fill:#ffffff;fill-opacity:1;stroke:#dd8123;stroke-width:0.94898325;stroke-linecap:butt;stroke-linejoin:miter;stroke-miterlimit:4;stroke-dasharray:none;stroke-dashoffset:0;stroke-opacity:1"
       id="rect1865-3-8-8"
       width="222.50188"
       height="28.597853"
       x="-0.71728843"
       y="195.53366"
       rx="6.7468748"
       ry="0.088589646" />
    <g
       id="g1828"
       transform="translate(-10.205357,12.727331)">
      <rect
         ry="0.088589646"
         rx="6.7468748"
         y="193.56261"
         x="22.183369"
         height="13.764384"
         width="30.60236"
         id="rect1374-5"
         style="opacity:1;vector-effect:none;fill:#ffffff;fill-opacity:1;stroke:#000000;stroke-width:0.94898325;stroke-linecap:butt;stroke-linejoin:miter;stroke-miterlimit:4;stroke-dasharray:none;stroke-dashoffset:0;stroke-opacity:1" />
      <text
         id="text1217"
         y="199.26506"
         x="25.123335"
         style="font-style:normal;font-weight:normal;font-size:3.52777767px;line-height:1.25;font-family:sans-serif;letter-spacing:0px;word-spacing:0px;fill:#000000;fill-opacity:1;stroke:none;stroke-width:0.26458332"
         xml:space="preserve"><tspan
           style="stroke-width:0.26458332"
           y="199.26506"
           x="25.123335"
           id="tspan1215"
           sodipodi:role="line">Core</tspan><tspan
           id="tspan1219"
           style="stroke-width:0.26458332"
           y="203.67479"
           x="25.123335"
           sodipodi:role="line">libraries</tspan></text>
    </g>
    <g
       id="g1822"
       transform="translate(-29.961483,12.727331)">
      <rect
         ry="0.088589646"
         rx="6.7468748"
         y="193.56261"
         x="100.23549"
         height="13.764384"
         width="30.60236"
         id="rect1374-5-9"
         style="opacity:1;vector-effect:none;fill:#ffffff;fill-opacity:1;stroke:#000000;stroke-width:0.94898325;stroke-linecap:butt;stroke-linejoin:miter;stroke-miterlimit:4;stroke-dasharray:none;stroke-dashoffset:0;stroke-opacity:1" />
      <text
         id="text837-5"
         y="199.26506"
         x="102.78892"
         style="font-style:normal;font-weight:normal;font-size:3.52777767px;line-height:1.25;font-family:sans-serif;letter-spacing:0px;word-spacing:0px;fill:#000000;fill-opacity:1;stroke:none;stroke-width:0.26458332"
         xml:space="preserve"><tspan
           id="tspan839-74"
           style="stroke-width:0.26458332"
           y="199.26506"
           x="102.78892"
           sodipodi:role="line">UI toolkit</tspan><tspan
           id="tspan849-68"
           style="font-size:2.82222223px;stroke-width:0.26458332"
           y="203.67479"
           x="102.78892"
           sodipodi:role="line">  (GTK)</tspan></text>
    </g>
    <g
       id="g1816"
       transform="translate(-49.717617,12.727331)">
      <rect
         ry="0.088589646"
         rx="6.7468748"
         y="193.56261"
         x="178.28761"
         height="13.764384"
         width="30.60236"
         id="rect1374-5-7"
         style="opacity:1;vector-effect:none;fill:#ffffff;fill-opacity:1;stroke:#000000;stroke-width:0.94898325;stroke-linecap:butt;stroke-linejoin:miter;stroke-miterlimit:4;stroke-dasharray:none;stroke-dashoffset:0;stroke-opacity:1" />
      <text
         id="text837-8"
         y="199.26506"
         x="180.4545"
         style="font-style:normal;font-weight:normal;font-size:3.52777767px;line-height:1.25;font-family:sans-serif;letter-spacing:0px;word-spacing:0px;fill:#000000;fill-opacity:1;stroke:none;stroke-width:0.26458332"
         xml:space="preserve"><tspan
           id="tspan843-2"
           style="stroke-width:0.26458332"
           y="199.26506"
           x="180.4545"
           sodipodi:role="line">Multimedia</tspan><tspan
           id="tspan849-9"
           style="font-size:2.82222223px;stroke-width:0.26458332"
           y="203.67479"
           x="180.4545"
           sodipodi:role="line">  (GStreamer)</tspan></text>
    </g>
    <text
       xml:space="preserve"
       style="font-style:normal;font-weight:normal;font-size:3.52777767px;line-height:1.25;font-family:sans-serif;letter-spacing:0px;word-spacing:0px;fill:#000000;fill-opacity:1;stroke:none;stroke-width:0.26458332"
       x="11.400499"
       y="202.15672"
       id="text1304"><tspan
         sodipodi:role="line"
         id="tspan1302"
         x="11.400499"
         y="202.15672"
         style="stroke-width:0.26458332">System libraries</tspan></text>
    <g
       id="g2005"
       transform="translate(-10.205357,13.325528)">
      <rect
         ry="0.088589646"
         rx="6.7468748"
         y="142.06067"
         x="9.4880686"
         height="34.477776"
         width="222.50188"
         id="rect1865-3-8"
         style="opacity:1;vector-effect:none;fill:#ffffff;fill-opacity:1;stroke:#8a35d8;stroke-width:0.94898325;stroke-linecap:butt;stroke-linejoin:miter;stroke-miterlimit:4;stroke-dasharray:none;stroke-dashoffset:0;stroke-opacity:1" />
      <g
         transform="translate(0,4.2333335)"
         id="g1782">
        <rect
           style="opacity:1;vector-effect:none;fill:#ffffff;fill-opacity:1;stroke:#000000;stroke-width:0.94898325;stroke-linecap:butt;stroke-linejoin:miter;stroke-miterlimit:4;stroke-dasharray:none;stroke-dashoffset:0;stroke-opacity:1"
           id="rect1374-9"
           width="30.60236"
           height="18.174328"
           x="22.183369"
           y="146.99596"
           rx="6.7468748"
           ry="0.088589646" />
        <text
           xml:space="preserve"
           style="font-style:normal;font-weight:normal;font-size:3.52777767px;line-height:1.25;font-family:sans-serif;letter-spacing:0px;word-spacing:0px;fill:#000000;fill-opacity:1;stroke:none;stroke-width:0.26458332"
           x="25.123335"
           y="152.77509"
           id="text1113"><tspan
             sodipodi:role="line"
             id="tspan1111"
             x="25.123335"
             y="152.77509"
             style="stroke-width:0.26458332">Service</tspan><tspan
             sodipodi:role="line"
             x="25.123335"
             y="157.18481"
             style="stroke-width:0.26458332"
             id="tspan1115">manager</tspan><tspan
             sodipodi:role="line"
             x="25.123335"
             y="161.59453"
             style="font-size:2.82222223px;stroke-width:0.26458332"
             id="tspan1117">(systemd)</tspan></text>
      </g>
      <g
         transform="translate(3.96875,4.2333335)"
         id="g1789">
        <rect
           style="opacity:1;vector-effect:none;fill:#ffffff;fill-opacity:1;stroke:#000000;stroke-width:0.94898325;stroke-linecap:butt;stroke-linejoin:miter;stroke-miterlimit:4;stroke-dasharray:none;stroke-dashoffset:0;stroke-opacity:1"
           id="rect1374-9-7"
           width="30.60236"
           height="18.174328"
           x="61.209427"
           y="146.99596"
           rx="6.7468748"
           ry="0.088589646" />
        <text
           xml:space="preserve"
           style="font-style:normal;font-weight:normal;font-size:3.52777767px;line-height:1.25;font-family:sans-serif;letter-spacing:0px;word-spacing:0px;fill:#000000;fill-opacity:1;stroke:none;stroke-width:0.26458332"
           x="64.518021"
           y="152.66656"
           id="text1113-5"><tspan
             sodipodi:role="line"
             x="64.518021"
             y="152.66656"
             style="stroke-width:0.26458332"
             id="tspan1115-3">Message</tspan><tspan
             sodipodi:role="line"
             x="64.518021"
             y="157.07629"
             style="stroke-width:0.26458332"
             id="tspan1149">bus</tspan><tspan
             sodipodi:role="line"
             x="64.518021"
             y="161.48601"
             style="font-size:2.82222223px;stroke-width:0.26458332"
             id="tspan1117-6">(D-Bus)</tspan></text>
      </g>
      <g
         transform="translate(7.9375,4.2333335)"
         id="g1796">
        <rect
           style="opacity:1;vector-effect:none;fill:#ffffff;fill-opacity:1;stroke:#000000;stroke-width:0.94898325;stroke-linecap:butt;stroke-linejoin:miter;stroke-miterlimit:4;stroke-dasharray:none;stroke-dashoffset:0;stroke-opacity:1"
           id="rect1374-9-71"
           width="30.60236"
           height="18.174328"
           x="100.2355"
           y="146.99596"
           rx="6.7468748"
           ry="0.088589646" />
        <text
           xml:space="preserve"
           style="font-style:normal;font-weight:normal;font-size:3.52777767px;line-height:1.25;font-family:sans-serif;letter-spacing:0px;word-spacing:0px;fill:#000000;fill-opacity:1;stroke:none;stroke-width:0.26458332"
           x="102.51089"
           y="152.77509"
           id="text1113-1"><tspan
             sodipodi:role="line"
             x="102.51089"
             y="152.77509"
             style="stroke-width:0.26458332"
             id="tspan1115-6">Networking</tspan><tspan
             sodipodi:role="line"
             x="102.51089"
             y="157.18481"
             style="font-size:2.82222223px;stroke-width:0.26458332"
             id="tspan1117-3">(bluez, ofono,</tspan><tspan
             sodipodi:role="line"
             x="102.51089"
             y="161.59453"
             style="font-size:2.82222223px;stroke-width:0.26458332"
             id="tspan1213"> connman)</tspan></text>
      </g>
      <g
         transform="translate(11.906266,4.2333335)"
         id="g1803">
        <rect
           style="opacity:1;vector-effect:none;fill:#ffffff;fill-opacity:1;stroke:#000000;stroke-width:0.94898325;stroke-linecap:butt;stroke-linejoin:miter;stroke-miterlimit:4;stroke-dasharray:none;stroke-dashoffset:0;stroke-opacity:1"
           id="rect1374-9-5"
           width="30.60236"
           height="18.174328"
           x="139.26155"
           y="146.99596"
           rx="6.7468748"
           ry="0.088589646" />
        <text
           xml:space="preserve"
           style="font-style:normal;font-weight:normal;font-size:3.52777767px;line-height:1.25;font-family:sans-serif;letter-spacing:0px;word-spacing:0px;fill:#000000;fill-opacity:1;stroke:none;stroke-width:0.26458332"
           x="142.44406"
           y="152.77509"
           id="text1113-2"><tspan
             sodipodi:role="line"
             id="tspan1111-06"
             x="142.44406"
             y="152.77509"
             style="stroke-width:0.26458332">Policy</tspan><tspan
             sodipodi:role="line"
             x="142.44406"
             y="157.18481"
             style="stroke-width:0.26458332"
             id="tspan1115-1">manager</tspan><tspan
             sodipodi:role="line"
             x="142.44406"
             y="161.59453"
             style="font-size:2.82222223px;stroke-width:0.26458332"
             id="tspan1117-5">(polkit)</tspan></text>
      </g>
      <g
         transform="translate(15.875,4.2333335)"
         id="g1810">
        <rect
           style="opacity:1;vector-effect:none;fill:#ffffff;fill-opacity:1;stroke:#000000;stroke-width:0.94898325;stroke-linecap:butt;stroke-linejoin:miter;stroke-miterlimit:4;stroke-dasharray:none;stroke-dashoffset:0;stroke-opacity:1"
           id="rect1374-9-1"
           width="30.60236"
           height="18.174328"
           x="178.28761"
           y="146.99596"
           rx="6.7468748"
           ry="0.088589646" />
        <text
           xml:space="preserve"
           style="font-style:normal;font-weight:normal;font-size:3.52777767px;line-height:1.25;font-family:sans-serif;letter-spacing:0px;word-spacing:0px;fill:#000000;fill-opacity:1;stroke:none;stroke-width:0.26458332"
           x="180.4545"
           y="152.77509"
           id="text1113-3"><tspan
             sodipodi:role="line"
             id="tspan1111-74"
             x="180.4545"
             y="152.77509"
             style="stroke-width:0.26458332">Updates</tspan><tspan
             sodipodi:role="line"
             x="180.4545"
             y="157.18481"
             style="stroke-width:0.26458332"
             id="tspan1115-5">manager</tspan><tspan
             sodipodi:role="line"
             x="180.4545"
             y="161.59453"
             style="font-size:2.82222223px;stroke-width:0.26458332"
             id="tspan1117-2">(aum/ostree)</tspan></text>
      </g>
      <text
         id="text1308"
         y="148.18901"
         x="21.605856"
         style="font-style:normal;font-weight:normal;font-size:3.52777767px;line-height:1.25;font-family:sans-serif;letter-spacing:0px;word-spacing:0px;fill:#000000;fill-opacity:1;stroke:none;stroke-width:0.26458332"
         xml:space="preserve"><tspan
           style="stroke-width:0.26458332"
           y="148.18901"
           x="21.605856"
           id="tspan1306"
           sodipodi:role="line">System services</tspan></text>
    </g>
    <rect
       style="opacity:1;vector-effect:none;fill:#ffffff;fill-opacity:1;stroke:#da2323;stroke-width:0.94898325;stroke-linecap:butt;stroke-linejoin:miter;stroke-miterlimit:4;stroke-dasharray:none;stroke-dashoffset:0;stroke-opacity:1"
       id="rect1865-3"
       width="222.50188"
       height="54.122086"
       x="-0.71728843"
       y="95.594421"
       rx="6.7468748"
       ry="0.088589646" />
    <g
       id="g1742"
       transform="translate(5.669643,11.212704)">
      <g
         transform="translate(0.99464417)"
         id="g1565">
        <rect
           style="opacity:1;vector-effect:none;fill:#ffffff;fill-opacity:1;stroke:#000000;stroke-width:0.94898325;stroke-linecap:butt;stroke-linejoin:miter;stroke-miterlimit:4;stroke-dasharray:none;stroke-dashoffset:0;stroke-opacity:1"
           id="rect1374-6-8-2"
           width="30.60236"
           height="22.450653"
           x="177.29297"
           y="95.159134"
           rx="6.7468748"
           ry="0.088589646" />
        <text
           xml:space="preserve"
           style="font-style:normal;font-weight:normal;font-size:3.52777767px;line-height:1.25;font-family:sans-serif;letter-spacing:0px;word-spacing:0px;fill:#000000;fill-opacity:1;stroke:none;stroke-width:0.26458332"
           x="180.4545"
           y="100.82416"
           id="text1035"><tspan
             sodipodi:role="line"
             id="tspan1033"
             x="180.4545"
             y="100.82416"
             style="stroke-width:0.26458332">Download</tspan><tspan
             sodipodi:role="line"
             x="180.4545"
             y="105.23388"
             style="stroke-width:0.26458332"
             id="tspan1037">manager</tspan></text>
      </g>
    </g>
    <g
       id="g1087"
       transform="translate(-2.5390605,14.784756)">
      <rect
         ry="0.088589646"
         rx="6.7468748"
         y="106.37184"
         x="118.34969"
         height="9.2208118"
         width="30.602364"
         id="rect1374-6-8-7"
         style="opacity:1;vector-effect:none;fill:#ffffff;fill-opacity:1;stroke:#000000;stroke-width:0.94898325;stroke-linecap:butt;stroke-linejoin:miter;stroke-miterlimit:4;stroke-dasharray:none;stroke-dashoffset:0;stroke-opacity:1" />
      <text
         id="text1041"
         y="112.03687"
         x="121.32092"
         style="font-style:normal;font-weight:normal;font-size:3.52777767px;line-height:1.25;font-family:sans-serif;letter-spacing:0px;word-spacing:0px;fill:#000000;fill-opacity:1;stroke:none;stroke-width:0.26458332"
         xml:space="preserve"><tspan
           style="stroke-width:0.26458332"
           y="112.03687"
           x="121.32092"
           id="tspan1039"
           sodipodi:role="line">Settings</tspan></text>
    </g>
    <g
       id="g1097"
       transform="translate(-10.770693,15.552344)">
      <rect
         ry="0.088589646"
         rx="6.7468748"
         y="120.389"
         x="144.4369"
         height="9.2208118"
         width="30.602365"
         id="rect1374-6-8-7-7"
         style="opacity:1;vector-effect:none;fill:#ffffff;fill-opacity:1;stroke:#000000;stroke-width:0.94898325;stroke-linecap:butt;stroke-linejoin:miter;stroke-miterlimit:4;stroke-dasharray:none;stroke-dashoffset:0;stroke-opacity:1" />
      <text
         id="text1045"
         y="126.18068"
         x="146.98946"
         style="font-style:normal;font-weight:normal;font-size:3.52777767px;line-height:1.25;font-family:sans-serif;letter-spacing:0px;word-spacing:0px;fill:#000000;fill-opacity:1;stroke:none;stroke-width:0.26458332"
         xml:space="preserve"><tspan
           style="stroke-width:0.26458332"
           y="126.18068"
           x="146.98946"
           id="tspan1043"
           sodipodi:role="line">Geolocation</tspan></text>
    </g>
    <g
       id="g1775"
       transform="translate(-10.205357,11.212704)">
      <rect
         ry="0.088589646"
         rx="6.7468748"
         y="95.159134"
         x="22.183369"
         height="22.450649"
         width="30.60236"
         id="rect1374-6"
         style="opacity:1;vector-effect:none;fill:#ffffff;fill-opacity:1;stroke:#000000;stroke-width:0.94898325;stroke-linecap:butt;stroke-linejoin:miter;stroke-miterlimit:4;stroke-dasharray:none;stroke-dashoffset:0;stroke-opacity:1" />
      <rect
         ry="0.088589646"
         rx="6.7468748"
         y="115.77512"
         x="25.358372"
         height="18.174328"
         width="30.60236"
         id="rect1374"
         style="opacity:1;vector-effect:none;fill:#ffffff;fill-opacity:1;stroke:#000000;stroke-width:0.94898325;stroke-linecap:butt;stroke-linejoin:miter;stroke-miterlimit:4;stroke-dasharray:none;stroke-dashoffset:0;stroke-opacity:1" />
      <text
         id="text968"
         y="100.82416"
         x="25.123335"
         style="font-style:normal;font-weight:normal;font-size:3.52777767px;line-height:1.25;font-family:sans-serif;letter-spacing:0px;word-spacing:0px;fill:#000000;fill-opacity:1;stroke:none;stroke-width:0.26458332"
         xml:space="preserve"><tspan
           id="tspan970"
           style="stroke-width:0.26458332"
           y="100.82416"
           x="25.123335"
           sodipodi:role="line">Audio</tspan><tspan
           id="tspan974"
           style="stroke-width:0.26458332"
           y="105.23388"
           x="25.123335"
           sodipodi:role="line">manager</tspan><tspan
           id="tspan976"
           style="font-size:2.82222223px;stroke-width:0.26458332"
           y="109.6436"
           x="25.123335"
           sodipodi:role="line">(PulseAudio,</tspan><tspan
           id="tspan978"
           style="font-size:2.82222223px;stroke-width:0.26458332"
           y="114.05332"
           x="25.123335"
           sodipodi:role="line"> PipeWire)</tspan></text>
      <text
         id="text1049"
         y="121.51065"
         x="28.298338"
         style="font-style:normal;font-weight:normal;font-size:3.52777767px;line-height:1.25;font-family:sans-serif;letter-spacing:0px;word-spacing:0px;fill:#000000;fill-opacity:1;stroke:none;stroke-width:0.26458332"
         xml:space="preserve"><tspan
           style="stroke-width:0.26458332"
           y="121.51065"
           x="28.298338"
           id="tspan1047"
           sodipodi:role="line">Product</tspan><tspan
           id="tspan1051"
           style="stroke-width:0.26458332"
           y="125.92037"
           x="28.298338"
           sodipodi:role="line">specific</tspan><tspan
           id="tspan1053"
           style="stroke-width:0.26458332"
           y="130.33009"
           x="28.298338"
           sodipodi:role="line">audio policy</tspan></text>
    </g>
    <g
       id="g1762"
       transform="translate(-5.2664627,11.212704)">
      <rect
         ry="0.088589646"
         rx="6.7468748"
         y="95.159134"
         x="74.041718"
         height="22.450651"
         width="30.60236"
         id="rect1374-6-8"
         style="opacity:1;vector-effect:none;fill:#ffffff;fill-opacity:1;stroke:#000000;stroke-width:0.94898325;stroke-linecap:butt;stroke-linejoin:miter;stroke-miterlimit:4;stroke-dasharray:none;stroke-dashoffset:0;stroke-opacity:1" />
      <rect
         ry="0.088589646"
         rx="6.7468748"
         y="115.77512"
         x="77.216721"
         height="18.174328"
         width="30.60236"
         id="rect1374-7"
         style="opacity:1;vector-effect:none;fill:#ffffff;fill-opacity:1;stroke:#000000;stroke-width:0.94898325;stroke-linecap:butt;stroke-linejoin:miter;stroke-miterlimit:4;stroke-dasharray:none;stroke-dashoffset:0;stroke-opacity:1" />
      <text
         id="text968-2"
         y="100.82416"
         x="77.49897"
         style="font-style:normal;font-weight:normal;font-size:3.52777767px;line-height:1.25;font-family:sans-serif;letter-spacing:0px;word-spacing:0px;fill:#000000;fill-opacity:1;stroke:none;stroke-width:0.26458332"
         xml:space="preserve"><tspan
           id="tspan970-3"
           style="stroke-width:0.26458332"
           y="100.82416"
           x="77.49897"
           sodipodi:role="line">Display</tspan><tspan
           id="tspan974-7"
           style="stroke-width:0.26458332"
           y="105.23388"
           x="77.49897"
           sodipodi:role="line">manager</tspan><tspan
           id="tspan978-9"
           style="font-size:2.82222223px;stroke-width:0.26458332"
           y="109.6436"
           x="77.49897"
           sodipodi:role="line">(Weston)</tspan></text>
      <text
         id="text1057"
         y="121.51065"
         x="80.673973"
         style="font-style:normal;font-weight:normal;font-size:3.52777767px;line-height:1.25;font-family:sans-serif;letter-spacing:0px;word-spacing:0px;fill:#000000;fill-opacity:1;stroke:none;stroke-width:0.26458332"
         xml:space="preserve"><tspan
           style="stroke-width:0.26458332"
           y="121.51065"
           x="80.673973"
           id="tspan1055"
           sodipodi:role="line">Product</tspan><tspan
           id="tspan1059"
           style="stroke-width:0.26458332"
           y="125.92037"
           x="80.673973"
           sodipodi:role="line">specific</tspan><tspan
           id="tspan1061"
           style="stroke-width:0.26458332"
           y="130.33009"
           x="80.673973"
           sodipodi:role="line">HMI shell</tspan></text>
    </g>
    <text
       xml:space="preserve"
       style="font-style:normal;font-weight:normal;font-size:3.52777767px;line-height:1.25;font-family:sans-serif;letter-spacing:0px;word-spacing:0px;fill:#000000;fill-opacity:1;stroke:none;stroke-width:0.26458332"
       x="11.400499"
       y="102.69855"
       id="text1312"><tspan
         sodipodi:role="line"
         id="tspan1310"
         x="11.400499"
         y="102.69855"
         style="stroke-width:0.26458332">Session services</tspan></text>
    <g
       id="g1857"
       transform="translate(2.494643,11.150296)">
      <rect
         ry="0.088589646"
         rx="6.7468748"
         y="227.56299"
         x="150.80853"
         height="13.229845"
         width="25.925144"
         id="rect1374-0-73"
         style="opacity:1;vector-effect:none;fill:#ffffff;fill-opacity:1;stroke:#000000;stroke-width:0.94898325;stroke-linecap:butt;stroke-linejoin:miter;stroke-miterlimit:4;stroke-dasharray:none;stroke-dashoffset:0;stroke-opacity:1" />
      <text
         id="text1320"
         y="232.98894"
         x="153.01091"
         style="font-style:normal;font-weight:normal;font-size:3.52777767px;line-height:1.25;font-family:sans-serif;letter-spacing:0px;word-spacing:0px;fill:#000000;fill-opacity:1;stroke:none;stroke-width:0.26458332"
         xml:space="preserve"><tspan
           style="stroke-width:0.26458332"
           y="232.98894"
           x="153.01091"
           id="tspan1318"
           sodipodi:role="line">Filesystem</tspan><tspan
           id="tspan1322"
           style="stroke-width:0.26458332"
           y="237.39867"
           x="153.01091"
           sodipodi:role="line">integrity</tspan></text>
    </g>
    <g
       id="g1851"
       transform="translate(-0.6803489,11.150296)">
      <rect
         ry="0.088589646"
         rx="6.7468748"
         y="227.56299"
         x="118.65225"
         height="13.229845"
         width="25.925144"
         id="rect1374-0-65"
         style="opacity:1;vector-effect:none;fill:#ffffff;fill-opacity:1;stroke:#000000;stroke-width:0.94898325;stroke-linecap:butt;stroke-linejoin:miter;stroke-miterlimit:4;stroke-dasharray:none;stroke-dashoffset:0;stroke-opacity:1" />
      <text
         id="text1326"
         y="232.98894"
         x="120.9212"
         style="font-style:normal;font-weight:normal;font-size:3.52777767px;line-height:1.25;font-family:sans-serif;letter-spacing:0px;word-spacing:0px;fill:#000000;fill-opacity:1;stroke:none;stroke-width:0.26458332"
         xml:space="preserve"><tspan
           style="stroke-width:0.26458332"
           y="232.98894"
           x="120.9212"
           id="tspan1324"
           sodipodi:role="line">Verified</tspan><tspan
           id="tspan1328"
           style="stroke-width:0.26458332"
           y="237.39867"
           x="120.9212"
           sodipodi:role="line">boot</tspan></text>
    </g>
    <g
       id="g1845"
       transform="translate(-3.855357,11.150296)">
      <rect
         ry="0.088589646"
         rx="6.7468748"
         y="227.56299"
         x="86.495956"
         height="13.229845"
         width="25.925144"
         id="rect1374-0-63"
         style="opacity:1;vector-effect:none;fill:#ffffff;fill-opacity:1;stroke:#000000;stroke-width:0.94898325;stroke-linecap:butt;stroke-linejoin:miter;stroke-miterlimit:4;stroke-dasharray:none;stroke-dashoffset:0;stroke-opacity:1" />
      <text
         id="text1332"
         y="232.98894"
         x="88.974388"
         style="font-style:normal;font-weight:normal;font-size:3.52777767px;line-height:1.25;font-family:sans-serif;letter-spacing:0px;word-spacing:0px;fill:#000000;fill-opacity:1;stroke:none;stroke-width:0.26458332"
         xml:space="preserve"><tspan
           style="stroke-width:0.26458332"
           y="232.98894"
           x="88.974388"
           id="tspan1330"
           sodipodi:role="line">AppArmor</tspan></text>
    </g>
    <g
       id="g1863"
       transform="translate(5.669643,11.150296)">
      <rect
         ry="0.088589646"
         rx="6.7468748"
         y="227.56299"
         x="182.96484"
         height="13.229845"
         width="25.925144"
         id="rect1374-0-6"
         style="opacity:1;vector-effect:none;fill:#ffffff;fill-opacity:1;stroke:#000000;stroke-width:0.94898325;stroke-linecap:butt;stroke-linejoin:miter;stroke-miterlimit:4;stroke-dasharray:none;stroke-dashoffset:0;stroke-opacity:1" />
      <text
         id="text1336"
         y="232.98894"
         x="185.21693"
         style="font-style:normal;font-weight:normal;font-size:3.52777767px;line-height:1.25;font-family:sans-serif;letter-spacing:0px;word-spacing:0px;fill:#000000;fill-opacity:1;stroke:none;stroke-width:0.26458332"
         xml:space="preserve"><tspan
           id="tspan1338"
           style="stroke-width:0.26458332"
           y="232.98894"
           x="185.21693"
           sodipodi:role="line">Filesystem</tspan><tspan
           id="tspan1348"
           style="stroke-width:0.26458332"
           y="237.39867"
           x="185.21693"
           sodipodi:role="line">encryption</tspan></text>
    </g>
    <g
       id="g1834"
       transform="translate(-10.205357,11.150296)">
      <rect
         ry="0.088589646"
         rx="6.7468748"
         y="227.56299"
         x="22.183369"
         height="13.229845"
         width="25.925142"
         id="rect1374-0"
         style="opacity:1;vector-effect:none;fill:#ffffff;fill-opacity:1;stroke:#000000;stroke-width:0.94898325;stroke-linecap:butt;stroke-linejoin:miter;stroke-miterlimit:4;stroke-dasharray:none;stroke-dashoffset:0;stroke-opacity:1" />
      <text
         id="text1342"
         y="232.98894"
         x="25.123335"
         style="font-style:normal;font-weight:normal;font-size:3.52777767px;line-height:1.25;font-family:sans-serif;letter-spacing:0px;word-spacing:0px;fill:#000000;fill-opacity:1;stroke:none;stroke-width:0.26458332"
         xml:space="preserve"><tspan
           id="tspan1344"
           style="stroke-width:0.26458332"
           y="232.98894"
           x="25.123335"
           sodipodi:role="line">Device</tspan><tspan
           id="tspan1352"
           style="stroke-width:0.26458332"
           y="237.39867"
           x="25.123335"
           sodipodi:role="line">drivers</tspan></text>
    </g>
    <g
       id="g1840"
       transform="translate(-7.0303489,11.150296)">
      <rect
         ry="0.088589646"
         rx="6.7468748"
         y="227.56299"
         x="54.339661"
         height="13.229845"
         width="25.925144"
         id="rect1374-0-7"
         style="opacity:1;vector-effect:none;fill:#ffffff;fill-opacity:1;stroke:#000000;stroke-width:0.94898325;stroke-linecap:butt;stroke-linejoin:miter;stroke-miterlimit:4;stroke-dasharray:none;stroke-dashoffset:0;stroke-opacity:1" />
      <text
         id="text1356"
         y="232.98894"
         x="56.087254"
         style="font-style:normal;font-weight:normal;font-size:3.52777767px;line-height:1.25;font-family:sans-serif;letter-spacing:0px;word-spacing:0px;fill:#000000;fill-opacity:1;stroke:none;stroke-width:0.26458332"
         xml:space="preserve"><tspan
           id="tspan1358"
           style="stroke-width:0.26458332"
           y="232.98894"
           x="56.087254"
           sodipodi:role="line">Cgroups and</tspan><tspan
           id="tspan1362"
           style="stroke-width:0.26458332"
           y="237.39867"
           x="56.087254"
           sodipodi:role="line">namespaces</tspan></text>
    </g>
    <g
       id="g2183"
       transform="translate(-10.205357,11.150296)">
      <rect
         ry="0.088589646"
         rx="6.7468748"
         y="2.0680761"
         x="9.4880686"
         height="76.706352"
         width="178.26877"
         id="rect1865"
         style="opacity:1;vector-effect:none;fill:#ffffff;fill-opacity:1;stroke:#52ae6a;stroke-width:0.94898325;stroke-linecap:butt;stroke-linejoin:miter;stroke-miterlimit:4;stroke-dasharray:none;stroke-dashoffset:0;stroke-opacity:1" />
      <g
         transform="translate(15.875)"
         id="g1735">
        <rect
           style="opacity:1;vector-effect:none;fill:#ffffff;fill-opacity:1;stroke:#000000;stroke-width:0.94898325;stroke-linecap:butt;stroke-linejoin:miter;stroke-miterlimit:4;stroke-dasharray:none;stroke-dashoffset:0;stroke-opacity:1"
           id="rect1374-4-9"
           width="30.60236"
           height="8.5526237"
           x="178.28761"
           y="13.116835"
           rx="6.7468748"
           ry="0.088589646" />
        <text
           xml:space="preserve"
           style="font-style:normal;font-weight:normal;font-size:3.52777767px;line-height:1.25;font-family:sans-serif;letter-spacing:0px;word-spacing:0px;fill:#000000;fill-opacity:1;stroke:none;stroke-width:0.26458332"
           x="180.4545"
           y="18.359596"
           id="text833"><tspan
             sodipodi:role="line"
             id="tspan831"
             x="180.4545"
             y="18.359596"
             style="stroke-width:0.26458332">Radio FM</tspan></text>
      </g>
      <g
         id="g1679">
        <rect
           style="opacity:1;vector-effect:none;fill:#ffffff;fill-opacity:1;stroke:#000000;stroke-width:0.94898325;stroke-linecap:butt;stroke-linejoin:miter;stroke-miterlimit:4;stroke-dasharray:none;stroke-dashoffset:0;stroke-opacity:1"
           id="rect1374-4"
           width="30.60236"
           height="8.5526237"
           x="22.183369"
           y="13.116822"
           rx="6.7468748"
           ry="0.088589646" />
        <rect
           style="opacity:1;vector-effect:none;fill:#ffffff;fill-opacity:1;stroke:#000000;stroke-width:0.94898325;stroke-linecap:butt;stroke-linejoin:miter;stroke-miterlimit:4;stroke-dasharray:none;stroke-dashoffset:0;stroke-opacity:1"
           id="rect1374-64"
           width="30.60236"
           height="35.134521"
           x="22.183369"
           y="23.78611"
           rx="6.7468748"
           ry="0.088589646" />
        <rect
           style="opacity:1;vector-effect:none;fill:#ffffff;fill-opacity:1;stroke:#000000;stroke-width:0.94898325;stroke-linecap:butt;stroke-linejoin:miter;stroke-miterlimit:4;stroke-dasharray:none;stroke-dashoffset:0;stroke-opacity:1"
           id="rect1374-2"
           width="30.60236"
           height="18.174328"
           x="25.358372"
           y="57.037659"
           rx="6.7468748"
           ry="0.088589646" />
        <text
           xml:space="preserve"
           style="font-style:normal;font-weight:normal;font-size:3.52777767px;line-height:1.25;font-family:sans-serif;letter-spacing:0px;word-spacing:0px;fill:#000000;fill-opacity:1;stroke:none;stroke-width:0.26458332"
           x="24.856066"
           y="18.359596"
           id="text817"><tspan
             sodipodi:role="line"
             id="tspan815"
             x="24.856066"
             y="18.359596"
             style="font-size:3.52777767px;stroke-width:0.26458332">Browser</tspan></text>
        <text
           xml:space="preserve"
           style="font-style:normal;font-weight:normal;font-size:3.52777767px;line-height:1.25;font-family:sans-serif;letter-spacing:0px;word-spacing:0px;fill:#000000;fill-opacity:1;stroke:none;stroke-width:0.26458332"
           x="25.123335"
           y="28.880733"
           id="text837"><tspan
             sodipodi:role="line"
             id="tspan835"
             x="25.123335"
             y="28.880733"
             style="stroke-width:0.26458332">Core libraries</tspan><tspan
             sodipodi:role="line"
             x="25.123335"
             y="33.290455"
             style="stroke-width:0.26458332"
             id="tspan839">UI toolkit</tspan><tspan
             sodipodi:role="line"
             x="25.123335"
             y="37.700176"
             style="font-size:2.82222223px;stroke-width:0.26458332"
             id="tspan841">  (GTK)</tspan><tspan
             sodipodi:role="line"
             x="25.123335"
             y="42.109901"
             style="stroke-width:0.26458332"
             id="tspan843">Multimedia</tspan><tspan
             sodipodi:role="line"
             x="25.123335"
             y="46.519623"
             style="font-size:2.82222223px;stroke-width:0.26458332"
             id="tspan845">  (GStreamer)</tspan><tspan
             sodipodi:role="line"
             x="25.123335"
             y="50.929344"
             style="stroke-width:0.26458332"
             id="tspan847">Web engine</tspan><tspan
             sodipodi:role="line"
             x="25.123335"
             y="55.339066"
             style="font-size:2.82222223px;stroke-width:0.26458332"
             id="tspan849">  (WebKitGTK)</tspan></text>
        <text
           xml:space="preserve"
           style="font-style:normal;font-weight:normal;font-size:3.52777767px;line-height:1.25;font-family:sans-serif;letter-spacing:0px;word-spacing:0px;fill:#000000;fill-opacity:1;stroke:none;stroke-width:0.26458332"
           x="28.298338"
           y="62.824078"
           id="text869"><tspan
             sodipodi:role="line"
             id="tspan867"
             x="28.298338"
             y="62.824078"
             style="stroke-width:0.26458332">Gfx drivers</tspan><tspan
             sodipodi:role="line"
             x="28.298338"
             y="67.233803"
             style="font-size:2.82222223px;stroke-width:0.26458332"
             id="tspan871">  (Mesa)</tspan><tspan
             sodipodi:role="line"
             x="28.298338"
             y="71.643524"
             style="stroke-width:0.26458332"
             id="tspan873">Codecs</tspan></text>
      </g>
      <g
         transform="translate(3.726331)"
         id="g1698">
        <rect
           style="opacity:1;vector-effect:none;fill:#ffffff;fill-opacity:1;stroke:#000000;stroke-width:0.94898325;stroke-linecap:butt;stroke-linejoin:miter;stroke-miterlimit:4;stroke-dasharray:none;stroke-dashoffset:0;stroke-opacity:1"
           id="rect1374-4-2"
           width="30.60236"
           height="8.5526237"
           x="61.05497"
           y="13.116835"
           rx="6.7468748"
           ry="0.088589646" />
        <rect
           style="opacity:1;vector-effect:none;fill:#ffffff;fill-opacity:1;stroke:#000000;stroke-width:0.94898325;stroke-linecap:butt;stroke-linejoin:miter;stroke-miterlimit:4;stroke-dasharray:none;stroke-dashoffset:0;stroke-opacity:1"
           id="rect1374-64-2"
           width="30.60236"
           height="35.134525"
           x="61.05497"
           y="23.786123"
           rx="6.7468748"
           ry="0.088589646" />
        <rect
           style="opacity:1;vector-effect:none;fill:#ffffff;fill-opacity:1;stroke:#000000;stroke-width:0.94898325;stroke-linecap:butt;stroke-linejoin:miter;stroke-miterlimit:4;stroke-dasharray:none;stroke-dashoffset:0;stroke-opacity:1"
           id="rect1374-2-6"
           width="30.60236"
           height="18.174328"
           x="64.229973"
           y="57.03767"
           rx="6.7468748"
           ry="0.088589646" />
        <text
           xml:space="preserve"
           style="font-style:normal;font-weight:normal;font-size:3.52777767px;line-height:1.25;font-family:sans-serif;letter-spacing:0px;word-spacing:0px;fill:#000000;fill-opacity:1;stroke:none;stroke-width:0.26458332"
           x="63.755703"
           y="18.359596"
           id="text821"><tspan
             sodipodi:role="line"
             id="tspan819"
             x="63.755703"
             y="18.359596"
             style="font-size:3.52777767px;stroke-width:0.26458332">Media player</tspan></text>
        <text
           xml:space="preserve"
           style="font-style:normal;font-weight:normal;font-size:3.52777767px;line-height:1.25;font-family:sans-serif;letter-spacing:0px;word-spacing:0px;fill:#000000;fill-opacity:1;stroke:none;stroke-width:0.26458332"
           x="63.933884"
           y="28.880733"
           id="text837-3"><tspan
             sodipodi:role="line"
             id="tspan835-6"
             x="63.933884"
             y="28.880733"
             style="stroke-width:0.26458332">Core libraries</tspan><tspan
             sodipodi:role="line"
             x="63.933884"
             y="33.290455"
             style="stroke-width:0.26458332"
             id="tspan839-7">UI toolkit</tspan><tspan
             sodipodi:role="line"
             x="63.933884"
             y="37.700176"
             style="font-size:2.82222223px;stroke-width:0.26458332"
             id="tspan841-5">  (GTK)</tspan><tspan
             sodipodi:role="line"
             x="63.933884"
             y="42.109901"
             style="stroke-width:0.26458332"
             id="tspan843-3">Multimedia</tspan><tspan
             sodipodi:role="line"
             x="63.933884"
             y="46.519623"
             style="font-size:2.82222223px;stroke-width:0.26458332"
             id="tspan845-5">  (GStreamer)</tspan><tspan
             sodipodi:role="line"
             x="63.933884"
             y="50.929344"
             style="stroke-width:0.26458332"
             id="tspan847-6">Web engine</tspan><tspan
             sodipodi:role="line"
             x="63.933884"
             y="55.339066"
             style="font-size:2.82222223px;stroke-width:0.26458332"
             id="tspan849-2">  (WebKitGTK)</tspan></text>
        <text
           xml:space="preserve"
           style="font-style:normal;font-weight:normal;font-size:3.52777767px;line-height:1.25;font-family:sans-serif;letter-spacing:0px;word-spacing:0px;fill:#000000;fill-opacity:1;stroke:none;stroke-width:0.26458332"
           x="67.108887"
           y="62.824078"
           id="text869-7"><tspan
             sodipodi:role="line"
             id="tspan867-3"
             x="67.108887"
             y="62.824078"
             style="stroke-width:0.26458332">Gfx drivers</tspan><tspan
             sodipodi:role="line"
             x="67.108887"
             y="67.233803"
             style="font-size:2.82222223px;stroke-width:0.26458332"
             id="tspan871-6">  (Mesa)</tspan><tspan
             sodipodi:role="line"
             x="67.108887"
             y="71.643524"
             style="stroke-width:0.26458332"
             id="tspan873-1">Codecs</tspan></text>
      </g>
      <g
         transform="translate(7.4083899)"
         id="g1715">
        <rect
           style="opacity:1;vector-effect:none;fill:#ffffff;fill-opacity:1;stroke:#000000;stroke-width:0.94898325;stroke-linecap:butt;stroke-linejoin:miter;stroke-miterlimit:4;stroke-dasharray:none;stroke-dashoffset:0;stroke-opacity:1"
           id="rect1374-4-1"
           width="30.60236"
           height="8.5526237"
           x="99.970863"
           y="13.116835"
           rx="6.7468748"
           ry="0.088589646" />
        <rect
           style="opacity:1;vector-effect:none;fill:#ffffff;fill-opacity:1;stroke:#000000;stroke-width:0.94898325;stroke-linecap:butt;stroke-linejoin:miter;stroke-miterlimit:4;stroke-dasharray:none;stroke-dashoffset:0;stroke-opacity:1"
           id="rect1374-64-0"
           width="30.60236"
           height="35.134525"
           x="99.970863"
           y="23.786123"
           rx="6.7468748"
           ry="0.088589646" />
        <rect
           style="opacity:1;vector-effect:none;fill:#ffffff;fill-opacity:1;stroke:#000000;stroke-width:0.94898325;stroke-linecap:butt;stroke-linejoin:miter;stroke-miterlimit:4;stroke-dasharray:none;stroke-dashoffset:0;stroke-opacity:1"
           id="rect1374-2-61"
           width="30.60236"
           height="18.174328"
           x="103.14584"
           y="57.03767"
           rx="6.7468748"
           ry="0.088589646" />
        <text
           xml:space="preserve"
           style="font-style:normal;font-weight:normal;font-size:3.52777767px;line-height:1.25;font-family:sans-serif;letter-spacing:0px;word-spacing:0px;fill:#000000;fill-opacity:1;stroke:none;stroke-width:0.26458332"
           x="102.65533"
           y="18.359596"
           id="text825"><tspan
             sodipodi:role="line"
             id="tspan823"
             x="102.65533"
             y="18.359596"
             style="stroke-width:0.26458332">Navigation</tspan></text>
        <text
           xml:space="preserve"
           style="font-style:normal;font-weight:normal;font-size:3.52777767px;line-height:1.25;font-family:sans-serif;letter-spacing:0px;word-spacing:0px;fill:#000000;fill-opacity:1;stroke:none;stroke-width:0.26458332"
           x="102.74442"
           y="28.880733"
           id="text837-9"><tspan
             sodipodi:role="line"
             id="tspan835-1"
             x="102.74442"
             y="28.880733"
             style="stroke-width:0.26458332">Core libraries</tspan><tspan
             sodipodi:role="line"
             x="102.74442"
             y="33.290455"
             style="stroke-width:0.26458332"
             id="tspan839-2">UI toolkit</tspan><tspan
             sodipodi:role="line"
             x="102.74442"
             y="37.700176"
             style="font-size:2.82222223px;stroke-width:0.26458332"
             id="tspan841-7">  (Qt)</tspan><tspan
             sodipodi:role="line"
             x="102.74442"
             y="42.109901"
             style="stroke-width:0.26458332"
             id="tspan843-0">Multimedia</tspan><tspan
             sodipodi:role="line"
             x="102.74442"
             y="46.519623"
             style="font-size:2.82222223px;stroke-width:0.26458332"
             id="tspan849-6">  (FFmpeg)</tspan></text>
        <text
           xml:space="preserve"
           style="font-style:normal;font-weight:normal;font-size:3.52777767px;line-height:1.25;font-family:sans-serif;letter-spacing:0px;word-spacing:0px;fill:#000000;fill-opacity:1;stroke:none;stroke-width:0.26458332"
           x="105.91941"
           y="62.824078"
           id="text869-2"><tspan
             sodipodi:role="line"
             id="tspan867-9"
             x="105.91941"
             y="62.824078"
             style="stroke-width:0.26458332">Gfx drivers</tspan><tspan
             sodipodi:role="line"
             x="105.91941"
             y="67.233803"
             style="font-size:2.82222223px;stroke-width:0.26458332"
             id="tspan871-3">  (Mesa)</tspan><tspan
             sodipodi:role="line"
             x="105.91941"
             y="71.643524"
             style="stroke-width:0.26458332"
             id="tspan873-19">Codecs</tspan></text>
      </g>
      <g
         transform="translate(10.848078)"
         id="g1730">
        <rect
           style="opacity:1;vector-effect:none;fill:#ffffff;fill-opacity:1;stroke:#000000;stroke-width:0.94898325;stroke-linecap:butt;stroke-linejoin:miter;stroke-miterlimit:4;stroke-dasharray:none;stroke-dashoffset:0;stroke-opacity:1"
           id="rect1374-4-5"
           width="30.60236"
           height="8.5526237"
           x="139.12912"
           y="13.116835"
           rx="6.7468748"
           ry="0.088589646" />
        <rect
           style="opacity:1;vector-effect:none;fill:#ffffff;fill-opacity:1;stroke:#000000;stroke-width:0.94898325;stroke-linecap:butt;stroke-linejoin:miter;stroke-miterlimit:4;stroke-dasharray:none;stroke-dashoffset:0;stroke-opacity:1"
           id="rect1374-64-9"
           width="30.60236"
           height="35.134525"
           x="139.12912"
           y="23.786123"
           rx="6.7468748"
           ry="0.088589646" />
        <rect
           style="opacity:1;vector-effect:none;fill:#ffffff;fill-opacity:1;stroke:#000000;stroke-width:0.94898325;stroke-linecap:butt;stroke-linejoin:miter;stroke-miterlimit:4;stroke-dasharray:none;stroke-dashoffset:0;stroke-opacity:1"
           id="rect1374-2-4"
           width="30.60236"
           height="18.174328"
           x="142.30411"
           y="57.03767"
           rx="6.7468748"
           ry="0.088589646" />
        <text
           xml:space="preserve"
           style="font-style:normal;font-weight:normal;font-size:3.52777767px;line-height:1.25;font-family:sans-serif;letter-spacing:0px;word-spacing:0px;fill:#000000;fill-opacity:1;stroke:none;stroke-width:0.26458332"
           x="141.55489"
           y="18.359596"
           id="text829"><tspan
             sodipodi:role="line"
             id="tspan827"
             x="141.55489"
             y="18.359596"
             style="stroke-width:0.26458332">Flickr</tspan></text>
        <text
           xml:space="preserve"
           style="font-style:normal;font-weight:normal;font-size:3.52777767px;line-height:1.25;font-family:sans-serif;letter-spacing:0px;word-spacing:0px;fill:#000000;fill-opacity:1;stroke:none;stroke-width:0.26458332"
           x="141.55489"
           y="28.880733"
           id="text837-0"><tspan
             sodipodi:role="line"
             id="tspan835-62"
             x="141.55489"
             y="28.880733"
             style="stroke-width:0.26458332">Core libraries</tspan><tspan
             sodipodi:role="line"
             x="141.55489"
             y="33.290455"
             style="stroke-width:0.26458332"
             id="tspan847-9">Web runtime</tspan><tspan
             sodipodi:role="line"
             x="141.55489"
             y="37.700176"
             style="font-size:2.82222223px;stroke-width:0.26458332"
             id="tspan849-20">  (Electron)</tspan></text>
        <text
           xml:space="preserve"
           style="font-style:normal;font-weight:normal;font-size:3.52777767px;line-height:1.25;font-family:sans-serif;letter-spacing:0px;word-spacing:0px;fill:#000000;fill-opacity:1;stroke:none;stroke-width:0.26458332"
           x="144.72984"
           y="62.824078"
           id="text869-4"><tspan
             sodipodi:role="line"
             id="tspan867-7"
             x="144.72984"
             y="62.824078"
             style="stroke-width:0.26458332">Gfx drivers</tspan><tspan
             sodipodi:role="line"
             x="144.72984"
             y="67.233803"
             style="font-size:2.82222223px;stroke-width:0.26458332"
             id="tspan871-8">  (Mesa)</tspan><tspan
             sodipodi:role="line"
             x="144.72984"
             y="71.643524"
             style="stroke-width:0.26458332"
             id="tspan873-4">Codecs</tspan></text>
      </g>
      <text
         id="text1316"
         y="8.6591616"
         x="21.605856"
         style="font-style:normal;font-weight:normal;font-size:3.52777767px;line-height:1.25;font-family:sans-serif;letter-spacing:0px;word-spacing:0px;fill:#000000;fill-opacity:1;stroke:none;stroke-width:0.26458332"
         xml:space="preserve"><tspan
           style="stroke-width:0.26458332"
           y="8.6591616"
           x="21.605856"
           id="tspan1314"
           sodipodi:role="line">Flatpak apps</tspan></text>
      <text
         transform="rotate(-90)"
         id="text1869"
         y="19.061069"
         x="-20.659348"
         style="font-style:normal;font-weight:normal;font-size:3.52777767px;line-height:1.25;font-family:sans-serif;letter-spacing:0px;word-spacing:0px;fill:#000000;fill-opacity:1;stroke:none;stroke-width:0.26458332"
         xml:space="preserve"><tspan
           style="font-size:2.82222223px;stroke-width:0.26458332"
           y="19.061069"
           x="-20.659348"
           id="tspan1867"
           sodipodi:role="line">Apps</tspan></text>
      <text
         transform="rotate(-90)"
         id="text1869-9"
         y="19.061069"
         x="-43.413521"
         style="font-style:normal;font-variant:normal;font-weight:normal;font-stretch:normal;font-size:2.82222223px;line-height:1.25;font-family:sans-serif;font-variant-ligatures:normal;font-variant-position:normal;font-variant-caps:normal;font-variant-numeric:normal;font-variant-alternates:normal;font-feature-settings:normal;text-indent:0;text-align:start;text-decoration:none;text-decoration-line:none;text-decoration-style:solid;text-decoration-color:#000000;letter-spacing:0px;word-spacing:0px;text-transform:none;writing-mode:lr-tb;direction:ltr;text-orientation:mixed;dominant-baseline:auto;baseline-shift:baseline;text-anchor:start;white-space:normal;shape-padding:0;opacity:1;vector-effect:none;fill:#000000;fill-opacity:1;stroke:none;stroke-width:0.26458332;stroke-linecap:butt;stroke-linejoin:miter;stroke-miterlimit:4;stroke-dasharray:none;stroke-dashoffset:0;stroke-opacity:1"
         xml:space="preserve"><tspan
           style="font-style:normal;font-variant:normal;font-weight:normal;font-stretch:normal;font-size:2.82222223px;line-height:1.25;font-family:sans-serif;font-variant-ligatures:normal;font-variant-position:normal;font-variant-caps:normal;font-variant-numeric:normal;font-variant-alternates:normal;font-feature-settings:normal;text-indent:0;text-align:start;text-decoration:none;text-decoration-line:none;text-decoration-style:solid;text-decoration-color:#000000;letter-spacing:0px;word-spacing:0px;text-transform:none;writing-mode:lr-tb;direction:ltr;text-orientation:mixed;dominant-baseline:auto;baseline-shift:baseline;text-anchor:start;white-space:normal;shape-padding:0;vector-effect:none;fill:#000000;fill-opacity:1;stroke:none;stroke-width:0.26458332;stroke-linecap:butt;stroke-linejoin:miter;stroke-miterlimit:4;stroke-dasharray:none;stroke-dashoffset:0;stroke-opacity:1"
           y="19.061069"
           x="-43.413521"
           id="tspan1867-4"
           sodipodi:role="line">Runtimes</tspan></text>
      <text
         transform="rotate(-90)"
         id="text1869-2"
         y="19.061069"
         x="-74.105194"
         style="font-style:normal;font-weight:normal;font-size:3.52777767px;line-height:1.25;font-family:sans-serif;letter-spacing:0px;word-spacing:0px;fill:#000000;fill-opacity:1;stroke:none;stroke-width:0.26458332"
         xml:space="preserve"><tspan
           style="font-size:2.82222223px;stroke-width:0.26458332"
           y="19.061069"
           x="-74.105194"
           id="tspan1867-9"
           sodipodi:role="line">Extensions</tspan></text>
      <text
         id="text1316-9"
         y="8.1299829"
         x="193.5851"
         style="font-style:normal;font-weight:normal;font-size:3.52777767px;line-height:1.25;font-family:sans-serif;letter-spacing:0px;word-spacing:0px;fill:#000000;fill-opacity:1;stroke:none;stroke-width:0.26458332"
         xml:space="preserve"><tspan
           style="stroke-width:0.26458332"
           y="8.1299829"
           x="193.5851"
           id="tspan1314-0"
           sodipodi:role="line">Standard apps</tspan></text>
    </g>
    <g
       id="g1092"
       transform="translate(-3.8754081,2.3425258)">
      <rect
         ry="0.088589646"
         rx="6.7468748"
         y="104.02931"
         x="144.42085"
         height="9.2208099"
         width="31.270546"
         id="rect1374-6-8-7-7-3"
         style="opacity:1;vector-effect:none;fill:#ffffff;fill-opacity:1;stroke:#000000;stroke-width:0.94898325;stroke-linecap:butt;stroke-linejoin:miter;stroke-miterlimit:4;stroke-dasharray:none;stroke-dashoffset:0;stroke-opacity:1" />
      <text
         id="text1045-6"
         y="109.82097"
         x="146.97342"
         style="font-style:normal;font-weight:normal;font-size:3.52777767px;line-height:1.25;font-family:sans-serif;letter-spacing:0px;word-spacing:0px;fill:#000000;fill-opacity:1;stroke:none;stroke-width:0.26458332"
         xml:space="preserve"><tspan
           style="stroke-width:0.26458332"
           y="109.82097"
           x="146.97342"
           id="tspan1043-7"
           sodipodi:role="line">Flatpak portals</tspan></text>
    </g>
  </g>
</svg>
