<?xml version="1.0" encoding="utf-8"?>
<!-- Generator: Adobe Illustrator 25.0.1, SVG Export Plug-In . SVG Version: 6.00 Build 0)  -->
<svg version="1.1" id="Layer_1" xmlns="http://www.w3.org/2000/svg" xmlns:xlink="http://www.w3.org/1999/xlink" x="0px" y="0px"
	 viewBox="0 0 32.03 15.04" style="enable-background:new 0 0 32.03 15.04;" xml:space="preserve">
<style type="text/css">
	.st0{fill:#FFFFFF;}
</style>
<rect class="st0" width="32.03" height="3.03"/>
<rect y="6" class="st0" width="32.03" height="3.03"/>
<rect y="12" class="st0" width="32.03" height="3.03"/>
</svg>
