<?xml version="1.0" encoding="UTF-8" standalone="no"?>
<!-- Created with Inkscape (http://www.inkscape.org/) -->

<svg
   xmlns:dc="http://purl.org/dc/elements/1.1/"
   xmlns:cc="http://creativecommons.org/ns#"
   xmlns:rdf="http://www.w3.org/1999/02/22-rdf-syntax-ns#"
   xmlns:svg="http://www.w3.org/2000/svg"
   xmlns="http://www.w3.org/2000/svg"
   xmlns:sodipodi="http://sodipodi.sourceforge.net/DTD/sodipodi-0.dtd"
   xmlns:inkscape="http://www.inkscape.org/namespaces/inkscape"
   width="420mm"
   height="297mm"
   viewBox="0 0 420 297.00001"
   version="1.1"
   id="svg8"
   inkscape:version="0.92.3 (2405546, 2018-03-11)"
   sodipodi:docname="fully_combined_release_roadmap.svg">
  <defs
     id="defs2" />
  <sodipodi:namedview
     id="base"
     pagecolor="#ffffff"
     bordercolor="#666666"
     borderopacity="1.0"
     inkscape:pageopacity="0.0"
     inkscape:pageshadow="2"
     inkscape:zoom="0.70710678"
     inkscape:cx="363.09297"
     inkscape:cy="701.85963"
     inkscape:document-units="px"
     inkscape:current-layer="layer1"
     showgrid="false"
     inkscape:measure-start="-60,630"
     inkscape:measure-end="780,630"
     inkscape:window-width="2695"
     inkscape:window-height="1183"
     inkscape:window-x="612"
     inkscape:window-y="108"
     inkscape:window-maximized="0"
     showguides="false"
     units="mm">
    <inkscape:grid
       type="xygrid"
       id="grid815"
       originx="137.98531"
       originy="-79.374989" />
  </sodipodi:namedview>
  <metadata
     id="metadata5">
    <rdf:RDF>
      <cc:Work
         rdf:about="">
        <dc:format>image/svg+xml</dc:format>
        <dc:type
           rdf:resource="http://purl.org/dc/dcmitype/StillImage" />
        <dc:title />
      </cc:Work>
    </rdf:RDF>
  </metadata>
  <g
     inkscape:label="Layer 1"
     inkscape:groupmode="layer"
     id="layer1"
     transform="translate(137.98533,79.375002)"
     style="display:inline">
    <rect
       y="140.13741"
       x="-137.45616"
       height="76.95842"
       width="420.18655"
       id="rect5564-6-3-0"
       style="display:inline;fill:#eedfff;fill-opacity:1;stroke:none;stroke-width:0.16454436;stroke-miterlimit:4;stroke-dasharray:none;stroke-opacity:1" />
    <rect
       y="34.074829"
       x="-137.45616"
       height="106.06258"
       width="420.18658"
       id="rect5564-6-3-0-0"
       style="display:inline;fill:#bebcff;fill-opacity:1;stroke:none;stroke-width:0.19316837;stroke-miterlimit:4;stroke-dasharray:none;stroke-opacity:1" />
    <rect
       y="-79.396088"
       x="-137.45616"
       height="113.47091"
       width="420.18661"
       id="rect5564-6-3-0-0-2"
       style="display:inline;fill:#e7caff;fill-opacity:1;stroke:none;stroke-width:0.19980079;stroke-miterlimit:4;stroke-dasharray:none;stroke-opacity:1" />
    <text
       xml:space="preserve"
       style="font-style:normal;font-weight:normal;font-size:10.58333302px;line-height:1.25;font-family:sans-serif;letter-spacing:0px;word-spacing:0px;fill:#000000;fill-opacity:1;stroke:none;stroke-width:0.26458332;stroke-linecap:square;stroke-miterlimit:10"
       x="183.41646"
       y="86.594528"
       id="text4518"
       inkscape:export-filename="/home/glunardi/roadmap.png"
       inkscape:export-xdpi="96"
       inkscape:export-ydpi="96"><tspan
         sodipodi:role="line"
         id="tspan4516"
         x="183.41646"
         y="95.958298"
         style="stroke-width:0.26458332" /></text>
    <path
       style="fill:none;stroke:#000000;stroke-width:0.36784375;stroke-linecap:butt;stroke-linejoin:miter;stroke-miterlimit:4;stroke-dasharray:0.36784373, 0.73568745;stroke-dashoffset:0;stroke-opacity:1"
       d="M -50.515685,-79.87409 V 217.09583"
       id="path1953-6-3-2"
       inkscape:connector-curvature="0"
       sodipodi:nodetypes="cc"
       inkscape:export-filename="/home/glunardi/roadmap.png"
       inkscape:export-xdpi="96"
       inkscape:export-ydpi="96" />
    <path
       style="fill:none;stroke:#000000;stroke-width:0.36784375;stroke-linecap:butt;stroke-linejoin:miter;stroke-miterlimit:4;stroke-dasharray:0.36784373, 0.73568745;stroke-dashoffset:0;stroke-opacity:1"
       d="M -6.0036772,-79.87409 V 217.09583"
       id="path1953-6-3-2-7"
       inkscape:connector-curvature="0"
       sodipodi:nodetypes="cc"
       inkscape:export-filename="/home/glunardi/roadmap.png"
       inkscape:export-xdpi="96"
       inkscape:export-ydpi="96" />
    <path
       style="fill:none;stroke:#000000;stroke-width:0.36784375;stroke-linecap:butt;stroke-linejoin:miter;stroke-miterlimit:4;stroke-dasharray:0.36784373, 0.73568745;stroke-dashoffset:0;stroke-opacity:1"
       d="M 216.55632,-79.87409 V 217.09583"
       id="path1953-6-3-2-1"
       inkscape:connector-curvature="0"
       sodipodi:nodetypes="cc"
       inkscape:export-filename="/home/glunardi/roadmap.png"
       inkscape:export-xdpi="96"
       inkscape:export-ydpi="96" />
    <path
       style="fill:none;stroke:#000000;stroke-width:0.36784375;stroke-linecap:butt;stroke-linejoin:miter;stroke-miterlimit:4;stroke-dasharray:0.36784373, 0.73568745;stroke-dashoffset:0;stroke-opacity:1"
       d="M 127.53232,-79.87409 V 217.09583"
       id="path1953-6-3-2-5"
       inkscape:connector-curvature="0"
       sodipodi:nodetypes="cc"
       inkscape:export-filename="/home/glunardi/roadmap.png"
       inkscape:export-xdpi="96"
       inkscape:export-ydpi="96" />
    <path
       style="fill:none;stroke:#000000;stroke-width:0.36784375;stroke-linecap:butt;stroke-linejoin:miter;stroke-miterlimit:4;stroke-dasharray:0.36784373, 0.73568745;stroke-dashoffset:0;stroke-opacity:1"
       d="M 38.508328,-79.87409 V 217.09583"
       id="path1953-6-3-2-8"
       inkscape:connector-curvature="0"
       sodipodi:nodetypes="cc"
       inkscape:export-filename="/home/glunardi/roadmap.png"
       inkscape:export-xdpi="96"
       inkscape:export-ydpi="96" />
    <path
       style="fill:none;stroke:#000000;stroke-width:0.36784375;stroke-linecap:butt;stroke-linejoin:miter;stroke-miterlimit:4;stroke-dasharray:0.36784373, 0.73568745;stroke-dashoffset:0;stroke-opacity:1"
       d="M 83.020308,-79.87409 V 217.09583"
       id="path1953-6-3-2-84"
       inkscape:connector-curvature="0"
       sodipodi:nodetypes="cc"
       inkscape:export-filename="/home/glunardi/roadmap.png"
       inkscape:export-xdpi="96"
       inkscape:export-ydpi="96" />
    <path
       style="fill:none;stroke:#000000;stroke-width:0.36784375;stroke-linecap:butt;stroke-linejoin:miter;stroke-miterlimit:4;stroke-dasharray:0.36784373, 0.73568745;stroke-dashoffset:0;stroke-opacity:1"
       d="M 172.04432,-79.87409 V 217.09583"
       id="path1953-6-3-2-56"
       inkscape:connector-curvature="0"
       sodipodi:nodetypes="cc"
       inkscape:export-filename="/home/glunardi/roadmap.png"
       inkscape:export-xdpi="96"
       inkscape:export-ydpi="96" />
    <text
       xml:space="preserve"
       style="font-style:normal;font-weight:normal;font-size:10.58333397px;line-height:1.25;font-family:sans-serif;letter-spacing:0px;word-spacing:0px;fill:#000000;fill-opacity:1;stroke:none;stroke-width:0.26458335"
       x="-127.93119"
       y="174.63539"
       id="text2410"><tspan
         sodipodi:role="line"
         id="tspan2408"
         x="-127.93119"
         y="174.63539"
         style="font-style:normal;font-variant:normal;font-weight:normal;font-stretch:normal;font-size:7.76111126px;line-height:1;font-family:Karla;-inkscape-font-specification:'Karla, Normal';font-variant-ligatures:normal;font-variant-caps:normal;font-variant-numeric:normal;font-feature-settings:normal;text-align:start;writing-mode:lr-tb;text-anchor:start;stroke-width:0.26458335">Debian 9</tspan><tspan
         sodipodi:role="line"
         x="-127.93119"
         y="187.86456"
         style="font-style:normal;font-variant:normal;font-weight:normal;font-stretch:normal;font-size:7.76111126px;line-height:1;font-family:Karla;-inkscape-font-specification:'Karla, Normal';font-variant-ligatures:normal;font-variant-caps:normal;font-variant-numeric:normal;font-feature-settings:normal;text-align:start;writing-mode:lr-tb;text-anchor:start;stroke-width:0.26458335"
         id="tspan2412">&quot;Stretch&quot;</tspan></text>
    <text
       xml:space="preserve"
       style="font-style:normal;font-weight:normal;font-size:10.58333397px;line-height:1.25;font-family:sans-serif;letter-spacing:0px;word-spacing:0px;display:inline;fill:#000000;fill-opacity:1;stroke:none;stroke-width:0.26458335"
       x="-127.93119"
       y="83.124893"
       id="text2410-0"><tspan
         sodipodi:role="line"
         id="tspan2408-0"
         x="-127.93119"
         y="83.124893"
         style="font-style:normal;font-variant:normal;font-weight:normal;font-stretch:normal;font-size:7.76111126px;line-height:1;font-family:Karla;-inkscape-font-specification:'Karla, Normal';font-variant-ligatures:normal;font-variant-caps:normal;font-variant-numeric:normal;font-feature-settings:normal;text-align:start;writing-mode:lr-tb;text-anchor:start;stroke-width:0.26458335">Debian 10</tspan><tspan
         sodipodi:role="line"
         x="-127.93119"
         y="96.354057"
         style="font-style:normal;font-variant:normal;font-weight:normal;font-stretch:normal;font-size:7.76111126px;line-height:1;font-family:Karla;-inkscape-font-specification:'Karla, Normal';font-variant-ligatures:normal;font-variant-caps:normal;font-variant-numeric:normal;font-feature-settings:normal;text-align:start;writing-mode:lr-tb;text-anchor:start;stroke-width:0.26458335"
         id="tspan2412-8">&quot;Buster&quot;</tspan></text>
    <text
       xml:space="preserve"
       style="font-style:normal;font-weight:normal;font-size:10.58333397px;line-height:1.25;font-family:sans-serif;letter-spacing:0px;word-spacing:0px;display:inline;fill:#000000;fill-opacity:1;stroke:none;stroke-width:0.26458335"
       x="-127.93119"
       y="-23.848082"
       id="text2410-6"><tspan
         sodipodi:role="line"
         id="tspan2408-8"
         x="-127.93119"
         y="-23.848082"
         style="font-style:normal;font-variant:normal;font-weight:normal;font-stretch:normal;font-size:7.76111126px;line-height:1;font-family:Karla;-inkscape-font-specification:'Karla, Normal';font-variant-ligatures:normal;font-variant-caps:normal;font-variant-numeric:normal;font-feature-settings:normal;text-align:start;writing-mode:lr-tb;text-anchor:start;stroke-width:0.26458335">Debian 11</tspan><tspan
         sodipodi:role="line"
         x="-127.93119"
         y="-10.618914"
         style="font-style:normal;font-variant:normal;font-weight:normal;font-stretch:normal;font-size:7.76111126px;line-height:1;font-family:Karla;-inkscape-font-specification:'Karla, Normal';font-variant-ligatures:normal;font-variant-caps:normal;font-variant-numeric:normal;font-feature-settings:normal;text-align:start;writing-mode:lr-tb;text-anchor:start;stroke-width:0.26458335"
         id="tspan2412-2">&quot;BullEye&quot;</tspan></text>
    <text
       xml:space="preserve"
       style="font-style:normal;font-weight:normal;font-size:10.58333397px;line-height:1.25;font-family:sans-serif;letter-spacing:0px;word-spacing:0px;display:inline;fill:#000000;fill-opacity:1;stroke:none;stroke-width:0.26458335"
       x="106.70039"
       y="31.535032"
       id="text2558-1-8-5"><tspan
         sodipodi:role="line"
         id="tspan2556-6-8-8"
         x="106.70039"
         y="31.535032"
         style="font-style:normal;font-variant:normal;font-weight:normal;font-stretch:normal;font-size:4.23333359px;font-family:Karla;-inkscape-font-specification:'Karla, Normal';font-variant-ligatures:normal;font-variant-caps:normal;font-variant-numeric:normal;font-feature-settings:normal;text-align:start;writing-mode:lr-tb;text-anchor:start;stroke-width:0.26458335">Release</tspan></text>
  </g>
  <g
     inkscape:groupmode="layer"
     id="layer2"
     inkscape:label="Layer 2"
     style="display:inline" />
  <g
     inkscape:groupmode="layer"
     id="layer3"
     inkscape:label="Layer 3"
     style="display:inline">
    <text
       xml:space="preserve"
       style="font-style:normal;font-weight:normal;font-size:5.58632231px;line-height:1.25;font-family:sans-serif;letter-spacing:0px;word-spacing:0px;fill:#000000;fill-opacity:1;stroke:none;stroke-width:0.13965808"
       x="13.061294"
       y="-398.01694"
       id="text1262-0-4-7-3"
       transform="rotate(90)"><tspan
         sodipodi:role="line"
         id="tspan1260-8-6-8-0"
         x="13.061294"
         y="-398.01694"
         style="font-style:normal;font-variant:normal;font-weight:normal;font-stretch:normal;font-size:5.58632231px;line-height:2;font-family:Karla;-inkscape-font-specification:'Karla, Normal';font-variant-ligatures:normal;font-variant-caps:normal;font-variant-numeric:normal;font-feature-settings:normal;text-align:start;writing-mode:lr-tb;text-anchor:start;stroke-width:0.13965808">- 23.7</tspan><tspan
         sodipodi:role="line"
         x="13.061294"
         y="-386.8443"
         style="font-style:normal;font-variant:normal;font-weight:normal;font-stretch:normal;font-size:5.58632231px;line-height:2;font-family:Karla;-inkscape-font-specification:'Karla, Normal';font-variant-ligatures:normal;font-variant-caps:normal;font-variant-numeric:normal;font-feature-settings:normal;text-align:start;writing-mode:lr-tb;text-anchor:start;stroke-width:0.13965808"
         id="tspan4732">- 23.6</tspan><tspan
         sodipodi:role="line"
         x="13.061294"
         y="-375.67166"
         style="font-style:normal;font-variant:normal;font-weight:normal;font-stretch:normal;font-size:5.58632231px;line-height:2;font-family:Karla;-inkscape-font-specification:'Karla, Normal';font-variant-ligatures:normal;font-variant-caps:normal;font-variant-numeric:normal;font-feature-settings:normal;text-align:start;writing-mode:lr-tb;text-anchor:start;stroke-width:0.13965808"
         id="tspan1264-1-6-2-7">- 23.5</tspan><tspan
         sodipodi:role="line"
         x="13.061294"
         y="-364.49899"
         style="font-style:normal;font-variant:normal;font-weight:normal;font-stretch:normal;font-size:5.58632231px;line-height:2;font-family:Karla;-inkscape-font-specification:'Karla, Normal';font-variant-ligatures:normal;font-variant-caps:normal;font-variant-numeric:normal;font-feature-settings:normal;text-align:start;writing-mode:lr-tb;text-anchor:start;stroke-width:0.13965808"
         id="tspan1266-2-0-1-7">- 23.4</tspan><tspan
         sodipodi:role="line"
         x="13.061294"
         y="-353.32635"
         style="font-style:normal;font-variant:normal;font-weight:normal;font-stretch:normal;font-size:5.58632231px;line-height:2;font-family:Karla;-inkscape-font-specification:'Karla, Normal';font-variant-ligatures:normal;font-variant-caps:normal;font-variant-numeric:normal;font-feature-settings:normal;text-align:start;writing-mode:lr-tb;text-anchor:start;stroke-width:0.13965808"
         id="tspan1268-2-2-0-7">- 23.3</tspan><tspan
         sodipodi:role="line"
         x="13.061294"
         y="-342.15372"
         style="font-style:normal;font-variant:normal;font-weight:normal;font-stretch:normal;font-size:5.58632231px;line-height:2;font-family:Karla;-inkscape-font-specification:'Karla, Normal';font-variant-ligatures:normal;font-variant-caps:normal;font-variant-numeric:normal;font-feature-settings:normal;text-align:start;writing-mode:lr-tb;text-anchor:start;stroke-width:0.13965808"
         id="tspan1270-6-5-5-6">- 23.2</tspan><tspan
         sodipodi:role="line"
         x="13.061294"
         y="-330.98108"
         style="font-style:normal;font-variant:normal;font-weight:normal;font-stretch:normal;font-size:5.58632231px;line-height:2;font-family:Karla;-inkscape-font-specification:'Karla, Normal';font-variant-ligatures:normal;font-variant-caps:normal;font-variant-numeric:normal;font-feature-settings:normal;text-align:start;writing-mode:lr-tb;text-anchor:start;stroke-width:0.13965808"
         id="tspan1272-9-8-8-9">- 23.1</tspan><tspan
         sodipodi:role="line"
         x="13.061294"
         y="-319.80841"
         style="font-style:normal;font-variant:normal;font-weight:normal;font-stretch:normal;font-size:5.58632231px;line-height:2;font-family:Karla;-inkscape-font-specification:'Karla, Normal';font-variant-ligatures:normal;font-variant-caps:normal;font-variant-numeric:normal;font-feature-settings:normal;text-align:start;writing-mode:lr-tb;text-anchor:start;stroke-width:0.13965808"
         id="tspan1274-1-9-5-1">- 23.0</tspan><tspan
         sodipodi:role="line"
         x="13.061294"
         y="-308.63577"
         style="font-style:normal;font-variant:normal;font-weight:normal;font-stretch:normal;font-size:5.58632231px;line-height:2;font-family:Karla;-inkscape-font-specification:'Karla, Normal';font-variant-ligatures:normal;font-variant-caps:normal;font-variant-numeric:normal;font-feature-settings:normal;text-align:start;writing-mode:lr-tb;text-anchor:start;stroke-width:0.13965808"
         id="tspan1276-0-5-5-1">- 23preview</tspan><tspan
         sodipodi:role="line"
         x="13.061294"
         y="-297.46313"
         style="font-style:normal;font-variant:normal;font-weight:normal;font-stretch:normal;font-size:5.58632231px;line-height:2;font-family:Karla;-inkscape-font-specification:'Karla, Normal';font-variant-ligatures:normal;font-variant-caps:normal;font-variant-numeric:normal;font-feature-settings:normal;text-align:start;writing-mode:lr-tb;text-anchor:start;stroke-width:0.13965808"
         id="tspan1278-4-0-0-9">- 23dev3</tspan><tspan
         sodipodi:role="line"
         x="13.061294"
         y="-286.2905"
         style="font-style:normal;font-variant:normal;font-weight:normal;font-stretch:normal;font-size:5.58632231px;line-height:2;font-family:Karla;-inkscape-font-specification:'Karla, Normal';font-variant-ligatures:normal;font-variant-caps:normal;font-variant-numeric:normal;font-feature-settings:normal;text-align:start;writing-mode:lr-tb;text-anchor:start;stroke-width:0.13965808"
         id="tspan1280-2-6-7-0">- 23dev2</tspan><tspan
         sodipodi:role="line"
         x="13.061294"
         y="-275.11786"
         style="font-style:normal;font-variant:normal;font-weight:normal;font-stretch:normal;font-size:5.58632231px;line-height:2;font-family:Karla;-inkscape-font-specification:'Karla, Normal';font-variant-ligatures:normal;font-variant-caps:normal;font-variant-numeric:normal;font-feature-settings:normal;text-align:start;writing-mode:lr-tb;text-anchor:start;stroke-width:0.13965808"
         id="tspan1282-7-0-3-8">- 23dev1</tspan><tspan
         sodipodi:role="line"
         x="13.061294"
         y="-263.94519"
         style="font-style:normal;font-variant:normal;font-weight:normal;font-stretch:normal;font-size:5.58632231px;line-height:2;font-family:Karla;-inkscape-font-specification:'Karla, Normal';font-variant-ligatures:normal;font-variant-caps:normal;font-variant-numeric:normal;font-feature-settings:normal;text-align:start;writing-mode:lr-tb;text-anchor:start;stroke-width:0.13965808"
         id="tspan1284-4-8-8-9">- 23dev0</tspan></text>
    <path
       style="fill:none;stroke:#000000;stroke-width:0.5291667;stroke-linecap:butt;stroke-linejoin:miter;stroke-miterlimit:4;stroke-dasharray:none;stroke-opacity:1"
       d="m 323.71279,13.483061 c 0,0 79.4887,-0.396875 75.81653,-0.396875"
       id="path1286-0-3-2-8"
       inkscape:connector-curvature="0"
       sodipodi:nodetypes="cc" />
    <text
       xml:space="preserve"
       style="font-style:normal;font-weight:normal;font-size:5.58632278px;line-height:1.25;font-family:sans-serif;letter-spacing:0px;word-spacing:0px;fill:#000000;fill-opacity:1;stroke:none;stroke-width:0.13965808"
       x="234.86983"
       y="17.517864"
       id="text1506"><tspan
         sodipodi:role="line"
         id="tspan1504"
         x="234.86983"
         y="17.517864"
         style="stroke-width:0.13965808">Apertis</tspan><tspan
         sodipodi:role="line"
         x="234.86983"
         y="24.500767"
         style="stroke-width:0.13965808"
         id="tspan1508">2023</tspan></text>
    <text
       xml:space="preserve"
       style="font-style:normal;font-weight:normal;font-size:5.57497501px;line-height:1.25;font-family:sans-serif;letter-spacing:0px;word-spacing:0px;fill:#000000;fill-opacity:1;stroke:none;stroke-width:0.13937439"
       x="60.14526"
       y="-353.67206"
       id="text1262-0-4-7"
       transform="matrix(0,1.0020354,-0.99796873,0,0,0)"><tspan
         sodipodi:role="line"
         id="tspan1260-8-6-8"
         x="60.14526"
         y="-353.67206"
         style="font-style:normal;font-variant:normal;font-weight:normal;font-stretch:normal;font-size:5.57497501px;line-height:2;font-family:Karla;-inkscape-font-specification:'Karla, Normal';font-variant-ligatures:normal;font-variant-caps:normal;font-variant-numeric:normal;font-feature-settings:normal;text-align:start;writing-mode:lr-tb;text-anchor:start;stroke-width:0.13937439">- 22.7</tspan><tspan
         sodipodi:role="line"
         x="60.14526"
         y="-342.52209"
         style="font-style:normal;font-variant:normal;font-weight:normal;font-stretch:normal;font-size:5.57497501px;line-height:2;font-family:Karla;-inkscape-font-specification:'Karla, Normal';font-variant-ligatures:normal;font-variant-caps:normal;font-variant-numeric:normal;font-feature-settings:normal;text-align:start;writing-mode:lr-tb;text-anchor:start;stroke-width:0.13937439"
         id="tspan4730">- 22.6</tspan><tspan
         sodipodi:role="line"
         x="60.14526"
         y="-331.37216"
         style="font-style:normal;font-variant:normal;font-weight:normal;font-stretch:normal;font-size:5.57497501px;line-height:2;font-family:Karla;-inkscape-font-specification:'Karla, Normal';font-variant-ligatures:normal;font-variant-caps:normal;font-variant-numeric:normal;font-feature-settings:normal;text-align:start;writing-mode:lr-tb;text-anchor:start;stroke-width:0.13937439"
         id="tspan1264-1-6-2">- 22.5</tspan><tspan
         sodipodi:role="line"
         x="60.14526"
         y="-320.2222"
         style="font-style:normal;font-variant:normal;font-weight:normal;font-stretch:normal;font-size:5.57497501px;line-height:2;font-family:Karla;-inkscape-font-specification:'Karla, Normal';font-variant-ligatures:normal;font-variant-caps:normal;font-variant-numeric:normal;font-feature-settings:normal;text-align:start;writing-mode:lr-tb;text-anchor:start;stroke-width:0.13937439"
         id="tspan1266-2-0-1">- 22.4</tspan><tspan
         sodipodi:role="line"
         x="60.14526"
         y="-309.07227"
         style="font-style:normal;font-variant:normal;font-weight:normal;font-stretch:normal;font-size:5.57497501px;line-height:2;font-family:Karla;-inkscape-font-specification:'Karla, Normal';font-variant-ligatures:normal;font-variant-caps:normal;font-variant-numeric:normal;font-feature-settings:normal;text-align:start;writing-mode:lr-tb;text-anchor:start;stroke-width:0.13937439"
         id="tspan1268-2-2-0">- 22.3</tspan><tspan
         sodipodi:role="line"
         x="60.14526"
         y="-297.9223"
         style="font-style:normal;font-variant:normal;font-weight:normal;font-stretch:normal;font-size:5.57497501px;line-height:2;font-family:Karla;-inkscape-font-specification:'Karla, Normal';font-variant-ligatures:normal;font-variant-caps:normal;font-variant-numeric:normal;font-feature-settings:normal;text-align:start;writing-mode:lr-tb;text-anchor:start;stroke-width:0.13937439"
         id="tspan1270-6-5-5">- 22.2</tspan><tspan
         sodipodi:role="line"
         x="60.14526"
         y="-286.77237"
         style="font-style:normal;font-variant:normal;font-weight:normal;font-stretch:normal;font-size:5.57497501px;line-height:2;font-family:Karla;-inkscape-font-specification:'Karla, Normal';font-variant-ligatures:normal;font-variant-caps:normal;font-variant-numeric:normal;font-feature-settings:normal;text-align:start;writing-mode:lr-tb;text-anchor:start;stroke-width:0.13937439"
         id="tspan1272-9-8-8">- 22.1</tspan><tspan
         sodipodi:role="line"
         x="60.14526"
         y="-275.62241"
         style="font-style:normal;font-variant:normal;font-weight:normal;font-stretch:normal;font-size:5.57497501px;line-height:2;font-family:Karla;-inkscape-font-specification:'Karla, Normal';font-variant-ligatures:normal;font-variant-caps:normal;font-variant-numeric:normal;font-feature-settings:normal;text-align:start;writing-mode:lr-tb;text-anchor:start;stroke-width:0.13937439"
         id="tspan1274-1-9-5">- 22.0</tspan><tspan
         sodipodi:role="line"
         x="60.14526"
         y="-264.47247"
         style="font-style:normal;font-variant:normal;font-weight:normal;font-stretch:normal;font-size:5.57497501px;line-height:2;font-family:Karla;-inkscape-font-specification:'Karla, Normal';font-variant-ligatures:normal;font-variant-caps:normal;font-variant-numeric:normal;font-feature-settings:normal;text-align:start;writing-mode:lr-tb;text-anchor:start;stroke-width:0.13937439"
         id="tspan1276-0-5-5">- 22preview</tspan><tspan
         sodipodi:role="line"
         x="60.14526"
         y="-253.32251"
         style="font-style:normal;font-variant:normal;font-weight:normal;font-stretch:normal;font-size:5.57497501px;line-height:2;font-family:Karla;-inkscape-font-specification:'Karla, Normal';font-variant-ligatures:normal;font-variant-caps:normal;font-variant-numeric:normal;font-feature-settings:normal;text-align:start;writing-mode:lr-tb;text-anchor:start;stroke-width:0.13937439"
         id="tspan1278-4-0-0">- 22dev3</tspan><tspan
         sodipodi:role="line"
         x="60.14526"
         y="-242.17256"
         style="font-style:normal;font-variant:normal;font-weight:normal;font-stretch:normal;font-size:5.57497501px;line-height:2;font-family:Karla;-inkscape-font-specification:'Karla, Normal';font-variant-ligatures:normal;font-variant-caps:normal;font-variant-numeric:normal;font-feature-settings:normal;text-align:start;writing-mode:lr-tb;text-anchor:start;stroke-width:0.13937439"
         id="tspan1280-2-6-7">- 22dev2</tspan><tspan
         sodipodi:role="line"
         x="60.14526"
         y="-231.02261"
         style="font-style:normal;font-variant:normal;font-weight:normal;font-stretch:normal;font-size:5.57497501px;line-height:2;font-family:Karla;-inkscape-font-specification:'Karla, Normal';font-variant-ligatures:normal;font-variant-caps:normal;font-variant-numeric:normal;font-feature-settings:normal;text-align:start;writing-mode:lr-tb;text-anchor:start;stroke-width:0.13937439"
         id="tspan1282-7-0-3">- 22dev1</tspan><tspan
         sodipodi:role="line"
         x="60.14526"
         y="-219.87265"
         style="font-style:normal;font-variant:normal;font-weight:normal;font-stretch:normal;font-size:5.57497501px;line-height:2;font-family:Karla;-inkscape-font-specification:'Karla, Normal';font-variant-ligatures:normal;font-variant-caps:normal;font-variant-numeric:normal;font-feature-settings:normal;text-align:start;writing-mode:lr-tb;text-anchor:start;stroke-width:0.13937439"
         id="tspan1284-4-8-8">- 22dev0</tspan></text>
    <path
       style="fill:none;stroke:#000000;stroke-width:0.5291667;stroke-linecap:butt;stroke-linejoin:miter;stroke-miterlimit:4;stroke-dasharray:none;stroke-opacity:1"
       d="m 279.33628,60.689454 h 75.2155"
       id="path1286-0-3-2"
       inkscape:connector-curvature="0"
       sodipodi:nodetypes="cc" />
    <text
       xml:space="preserve"
       style="font-style:normal;font-weight:normal;font-size:5.58632231px;line-height:1.25;font-family:sans-serif;letter-spacing:0px;word-spacing:0px;fill:#000000;fill-opacity:1;stroke:none;stroke-width:0.13965808"
       x="192.37294"
       y="64.724251"
       id="text1506-8"><tspan
         sodipodi:role="line"
         id="tspan1504-0"
         x="192.37294"
         y="64.724251"
         style="stroke-width:0.13965808">Apertis</tspan><tspan
         sodipodi:role="line"
         x="192.37294"
         y="71.707153"
         style="stroke-width:0.13965808"
         id="tspan1508-3">2022</tspan></text>
    <text
       xml:space="preserve"
       style="font-style:normal;font-weight:normal;font-size:5.57308149px;line-height:1.25;font-family:sans-serif;letter-spacing:0px;word-spacing:0px;fill:#000000;fill-opacity:1;stroke:none;stroke-width:0.13932706"
       x="161.85092"
       y="-264.63556"
       id="text1262-0"
       transform="matrix(0,1.0023758,-0.99762978,0,0,0)"><tspan
         sodipodi:role="line"
         id="tspan1260-8"
         x="161.85092"
         y="-264.63556"
         style="font-style:normal;font-variant:normal;font-weight:normal;font-stretch:normal;font-size:5.57308149px;line-height:2;font-family:Karla;-inkscape-font-specification:'Karla, Normal';font-variant-ligatures:normal;font-variant-caps:normal;font-variant-numeric:normal;font-feature-settings:normal;text-align:start;writing-mode:lr-tb;text-anchor:start;stroke-width:0.13932706">- 20.7</tspan><tspan
         sodipodi:role="line"
         x="161.85092"
         y="-253.4894"
         style="font-style:normal;font-variant:normal;font-weight:normal;font-stretch:normal;font-size:5.57308149px;line-height:2;font-family:Karla;-inkscape-font-specification:'Karla, Normal';font-variant-ligatures:normal;font-variant-caps:normal;font-variant-numeric:normal;font-feature-settings:normal;text-align:start;writing-mode:lr-tb;text-anchor:start;stroke-width:0.13932706"
         id="tspan4726">- 20.6</tspan><tspan
         sodipodi:role="line"
         x="161.85092"
         y="-242.34323"
         style="font-style:normal;font-variant:normal;font-weight:normal;font-stretch:normal;font-size:5.57308149px;line-height:2;font-family:Karla;-inkscape-font-specification:'Karla, Normal';font-variant-ligatures:normal;font-variant-caps:normal;font-variant-numeric:normal;font-feature-settings:normal;text-align:start;writing-mode:lr-tb;text-anchor:start;stroke-width:0.13932706"
         id="tspan1264-1">- 20.5</tspan><tspan
         sodipodi:role="line"
         x="161.85092"
         y="-231.19707"
         style="font-style:normal;font-variant:normal;font-weight:normal;font-stretch:normal;font-size:5.57308149px;line-height:2;font-family:Karla;-inkscape-font-specification:'Karla, Normal';font-variant-ligatures:normal;font-variant-caps:normal;font-variant-numeric:normal;font-feature-settings:normal;text-align:start;writing-mode:lr-tb;text-anchor:start;stroke-width:0.13932706"
         id="tspan1266-2">- 20.4</tspan><tspan
         sodipodi:role="line"
         x="161.85092"
         y="-220.0509"
         style="font-style:normal;font-variant:normal;font-weight:normal;font-stretch:normal;font-size:5.57308149px;line-height:2;font-family:Karla;-inkscape-font-specification:'Karla, Normal';font-variant-ligatures:normal;font-variant-caps:normal;font-variant-numeric:normal;font-feature-settings:normal;text-align:start;writing-mode:lr-tb;text-anchor:start;stroke-width:0.13932706"
         id="tspan1268-2">- 20.3</tspan><tspan
         sodipodi:role="line"
         x="161.85092"
         y="-208.90474"
         style="font-style:normal;font-variant:normal;font-weight:normal;font-stretch:normal;font-size:5.57308149px;line-height:2;font-family:Karla;-inkscape-font-specification:'Karla, Normal';font-variant-ligatures:normal;font-variant-caps:normal;font-variant-numeric:normal;font-feature-settings:normal;text-align:start;writing-mode:lr-tb;text-anchor:start;stroke-width:0.13932706"
         id="tspan1270-6">- 20.2</tspan><tspan
         sodipodi:role="line"
         x="161.85092"
         y="-197.75858"
         style="font-style:normal;font-variant:normal;font-weight:normal;font-stretch:normal;font-size:5.57308149px;line-height:2;font-family:Karla;-inkscape-font-specification:'Karla, Normal';font-variant-ligatures:normal;font-variant-caps:normal;font-variant-numeric:normal;font-feature-settings:normal;text-align:start;writing-mode:lr-tb;text-anchor:start;stroke-width:0.13932706"
         id="tspan1272-9">- 20.1</tspan><tspan
         sodipodi:role="line"
         x="161.85092"
         y="-186.61241"
         style="font-style:normal;font-variant:normal;font-weight:normal;font-stretch:normal;font-size:5.57308149px;line-height:2;font-family:Karla;-inkscape-font-specification:'Karla, Normal';font-variant-ligatures:normal;font-variant-caps:normal;font-variant-numeric:normal;font-feature-settings:normal;text-align:start;writing-mode:lr-tb;text-anchor:start;stroke-width:0.13932706"
         id="tspan1274-1">- 20.0</tspan><tspan
         sodipodi:role="line"
         x="161.85092"
         y="-175.46625"
         style="font-style:normal;font-variant:normal;font-weight:normal;font-stretch:normal;font-size:5.57308149px;line-height:2;font-family:Karla;-inkscape-font-specification:'Karla, Normal';font-variant-ligatures:normal;font-variant-caps:normal;font-variant-numeric:normal;font-feature-settings:normal;text-align:start;writing-mode:lr-tb;text-anchor:start;stroke-width:0.13932706"
         id="tspan1276-0">- 20preview</tspan><tspan
         sodipodi:role="line"
         x="161.85092"
         y="-164.3201"
         style="font-style:normal;font-variant:normal;font-weight:normal;font-stretch:normal;font-size:5.57308149px;line-height:2;font-family:Karla;-inkscape-font-specification:'Karla, Normal';font-variant-ligatures:normal;font-variant-caps:normal;font-variant-numeric:normal;font-feature-settings:normal;text-align:start;writing-mode:lr-tb;text-anchor:start;stroke-width:0.13932706"
         id="tspan1278-4">- 20dev3</tspan><tspan
         sodipodi:role="line"
         x="161.85092"
         y="-153.17393"
         style="font-style:normal;font-variant:normal;font-weight:normal;font-stretch:normal;font-size:5.57308149px;line-height:2;font-family:Karla;-inkscape-font-specification:'Karla, Normal';font-variant-ligatures:normal;font-variant-caps:normal;font-variant-numeric:normal;font-feature-settings:normal;text-align:start;writing-mode:lr-tb;text-anchor:start;stroke-width:0.13932706"
         id="tspan1280-2">- 20dev2</tspan><tspan
         sodipodi:role="line"
         x="161.85092"
         y="-142.02777"
         style="font-style:normal;font-variant:normal;font-weight:normal;font-stretch:normal;font-size:5.57308149px;line-height:2;font-family:Karla;-inkscape-font-specification:'Karla, Normal';font-variant-ligatures:normal;font-variant-caps:normal;font-variant-numeric:normal;font-feature-settings:normal;text-align:start;writing-mode:lr-tb;text-anchor:start;stroke-width:0.13932706"
         id="tspan1282-7">- 20dev1</tspan><tspan
         sodipodi:role="line"
         x="161.85092"
         y="-130.88161"
         style="font-style:normal;font-variant:normal;font-weight:normal;font-stretch:normal;font-size:5.57308149px;line-height:2;font-family:Karla;-inkscape-font-specification:'Karla, Normal';font-variant-ligatures:normal;font-variant-caps:normal;font-variant-numeric:normal;font-feature-settings:normal;text-align:start;writing-mode:lr-tb;text-anchor:start;stroke-width:0.13932706"
         id="tspan1284-4">- 20dev0</tspan></text>
    <path
       style="fill:none;stroke:#000000;stroke-width:0.5291667;stroke-linecap:butt;stroke-linejoin:miter;stroke-miterlimit:4;stroke-dasharray:none;stroke-opacity:1"
       d="M 187.35344,162.65723 H 266.0608"
       id="path1286-0"
       inkscape:connector-curvature="0"
       sodipodi:nodetypes="cc" />
    <text
       xml:space="preserve"
       style="font-style:normal;font-weight:normal;font-size:5.58632231px;line-height:1.25;font-family:sans-serif;letter-spacing:0px;word-spacing:0px;fill:#000000;fill-opacity:1;stroke:none;stroke-width:0.13965808"
       x="105.94839"
       y="166.69203"
       id="text1506-2"><tspan
         sodipodi:role="line"
         id="tspan1504-1"
         x="105.94839"
         y="166.69203"
         style="stroke-width:0.13965808">Apertis</tspan><tspan
         sodipodi:role="line"
         x="105.94839"
         y="173.67494"
         style="stroke-width:0.13965808"
         id="tspan1508-7">2020</tspan></text>
    <text
       xml:space="preserve"
       style="font-style:normal;font-weight:normal;font-size:5.57044649px;line-height:1.25;font-family:sans-serif;letter-spacing:0px;word-spacing:0px;fill:#000000;fill-opacity:1;stroke:none;stroke-width:0.13926117"
       x="227.44357"
       y="-219.97598"
       id="text1262"
       transform="matrix(0,1.0028501,-0.99715804,0,0,0)"><tspan
         sodipodi:role="line"
         x="227.44357"
         y="-219.97598"
         style="font-style:normal;font-variant:normal;font-weight:normal;font-stretch:normal;font-size:5.57044601px;line-height:2;font-family:Karla;-inkscape-font-specification:'Karla, Normal';font-variant-ligatures:normal;font-variant-caps:normal;font-variant-numeric:normal;font-feature-settings:normal;text-align:start;writing-mode:lr-tb;text-anchor:start;stroke-width:0.13926117"
         id="tspan4720">- 19.7</tspan><tspan
         sodipodi:role="line"
         x="227.44357"
         y="-208.83508"
         style="font-style:normal;font-variant:normal;font-weight:normal;font-stretch:normal;font-size:5.57044601px;line-height:2;font-family:Karla;-inkscape-font-specification:'Karla, Normal';font-variant-ligatures:normal;font-variant-caps:normal;font-variant-numeric:normal;font-feature-settings:normal;text-align:start;writing-mode:lr-tb;text-anchor:start;stroke-width:0.13926117"
         id="tspan4724">- 19.6</tspan><tspan
         sodipodi:role="line"
         x="227.44357"
         y="-197.6942"
         style="font-style:normal;font-variant:normal;font-weight:normal;font-stretch:normal;font-size:5.57044601px;line-height:2;font-family:Karla;-inkscape-font-specification:'Karla, Normal';font-variant-ligatures:normal;font-variant-caps:normal;font-variant-numeric:normal;font-feature-settings:normal;text-align:start;writing-mode:lr-tb;text-anchor:start;stroke-width:0.13926117"
         id="tspan1264">- 19.5</tspan><tspan
         sodipodi:role="line"
         x="227.44357"
         y="-186.55331"
         style="font-style:normal;font-variant:normal;font-weight:normal;font-stretch:normal;font-size:5.57044601px;line-height:2;font-family:Karla;-inkscape-font-specification:'Karla, Normal';font-variant-ligatures:normal;font-variant-caps:normal;font-variant-numeric:normal;font-feature-settings:normal;text-align:start;writing-mode:lr-tb;text-anchor:start;stroke-width:0.13926117"
         id="tspan1266">- 19.4</tspan><tspan
         sodipodi:role="line"
         x="227.44357"
         y="-175.41241"
         style="font-style:normal;font-variant:normal;font-weight:normal;font-stretch:normal;font-size:5.57044601px;line-height:2;font-family:Karla;-inkscape-font-specification:'Karla, Normal';font-variant-ligatures:normal;font-variant-caps:normal;font-variant-numeric:normal;font-feature-settings:normal;text-align:start;writing-mode:lr-tb;text-anchor:start;stroke-width:0.13926117"
         id="tspan1268">- 19.3</tspan><tspan
         sodipodi:role="line"
         x="227.44357"
         y="-164.27151"
         style="font-style:normal;font-variant:normal;font-weight:normal;font-stretch:normal;font-size:5.57044601px;line-height:2;font-family:Karla;-inkscape-font-specification:'Karla, Normal';font-variant-ligatures:normal;font-variant-caps:normal;font-variant-numeric:normal;font-feature-settings:normal;text-align:start;writing-mode:lr-tb;text-anchor:start;stroke-width:0.13926117"
         id="tspan1270">- 19.2</tspan><tspan
         sodipodi:role="line"
         x="227.44357"
         y="-153.13063"
         style="font-style:normal;font-variant:normal;font-weight:normal;font-stretch:normal;font-size:5.57044601px;line-height:2;font-family:Karla;-inkscape-font-specification:'Karla, Normal';font-variant-ligatures:normal;font-variant-caps:normal;font-variant-numeric:normal;font-feature-settings:normal;text-align:start;writing-mode:lr-tb;text-anchor:start;stroke-width:0.13926117"
         id="tspan1272">- 19.1</tspan><tspan
         sodipodi:role="line"
         x="227.44357"
         y="-141.98975"
         style="font-style:normal;font-variant:normal;font-weight:normal;font-stretch:normal;font-size:5.57044601px;line-height:2;font-family:Karla;-inkscape-font-specification:'Karla, Normal';font-variant-ligatures:normal;font-variant-caps:normal;font-variant-numeric:normal;font-feature-settings:normal;text-align:start;writing-mode:lr-tb;text-anchor:start;stroke-width:0.13926117"
         id="tspan1274">- 19.0</tspan><tspan
         sodipodi:role="line"
         x="227.44357"
         y="-130.84885"
         style="font-style:normal;font-variant:normal;font-weight:normal;font-stretch:normal;font-size:5.57044601px;line-height:2;font-family:Karla;-inkscape-font-specification:'Karla, Normal';font-variant-ligatures:normal;font-variant-caps:normal;font-variant-numeric:normal;font-feature-settings:normal;text-align:start;writing-mode:lr-tb;text-anchor:start;stroke-width:0.13926117"
         id="tspan1276">- 19preview</tspan><tspan
         sodipodi:role="line"
         x="227.44357"
         y="-119.70795"
         style="font-style:normal;font-variant:normal;font-weight:normal;font-stretch:normal;font-size:5.57044601px;line-height:2;font-family:Karla;-inkscape-font-specification:'Karla, Normal';font-variant-ligatures:normal;font-variant-caps:normal;font-variant-numeric:normal;font-feature-settings:normal;text-align:start;writing-mode:lr-tb;text-anchor:start;stroke-width:0.13926117"
         id="tspan1278">- 19dev3</tspan><tspan
         sodipodi:role="line"
         x="227.44357"
         y="-108.56706"
         style="font-style:normal;font-variant:normal;font-weight:normal;font-stretch:normal;font-size:5.57044601px;line-height:2;font-family:Karla;-inkscape-font-specification:'Karla, Normal';font-variant-ligatures:normal;font-variant-caps:normal;font-variant-numeric:normal;font-feature-settings:normal;text-align:start;writing-mode:lr-tb;text-anchor:start;stroke-width:0.13926117"
         id="tspan1280">- 19dev2</tspan><tspan
         sodipodi:role="line"
         x="227.44357"
         y="-97.42617"
         style="font-style:normal;font-variant:normal;font-weight:normal;font-stretch:normal;font-size:5.57044601px;line-height:2;font-family:Karla;-inkscape-font-specification:'Karla, Normal';font-variant-ligatures:normal;font-variant-caps:normal;font-variant-numeric:normal;font-feature-settings:normal;text-align:start;writing-mode:lr-tb;text-anchor:start;stroke-width:0.13926117"
         id="tspan1282">- 19dev1</tspan><tspan
         sodipodi:role="line"
         x="227.44357"
         y="-86.285278"
         style="font-style:normal;font-variant:normal;font-weight:normal;font-stretch:normal;font-size:5.57044601px;line-height:2;font-family:Karla;-inkscape-font-specification:'Karla, Normal';font-variant-ligatures:normal;font-variant-caps:normal;font-variant-numeric:normal;font-feature-settings:normal;text-align:start;writing-mode:lr-tb;text-anchor:start;stroke-width:0.13926117"
         id="tspan1284">- 19dev0</tspan></text>
    <path
       style="fill:none;stroke:#000000;stroke-width:0.55518001;stroke-linecap:butt;stroke-linejoin:miter;stroke-miterlimit:4;stroke-dasharray:none;stroke-opacity:1"
       d="m 145.3721,227.98445 h 75.64025"
       id="path1286"
       inkscape:connector-curvature="0" />
    <text
       xml:space="preserve"
       style="font-style:normal;font-weight:normal;font-size:5.58632231px;line-height:1.25;font-family:sans-serif;letter-spacing:0px;word-spacing:0px;fill:#000000;fill-opacity:1;stroke:none;stroke-width:0.13965808"
       x="61.801567"
       y="232.01921"
       id="text1506-79"><tspan
         sodipodi:role="line"
         id="tspan1504-7"
         x="61.801567"
         y="232.01921"
         style="stroke-width:0.13965808">Apertis   </tspan><tspan
         sodipodi:role="line"
         x="61.801567"
         y="239.00212"
         style="stroke-width:0.13965808"
         id="tspan1508-6">2019</tspan></text>
    <path
       style="fill:none;stroke:#ff0016;stroke-width:0.5291667;stroke-linecap:butt;stroke-linejoin:miter;stroke-miterlimit:4;stroke-dasharray:none;stroke-opacity:1"
       d="M 71.305211,271.07086 H 301.62501"
       id="path1708"
       inkscape:connector-curvature="0" />
    <path
       style="fill:none;stroke:#ff0016;stroke-width:0.5291667;stroke-linecap:butt;stroke-linejoin:miter;stroke-miterlimit:4;stroke-dasharray:none;stroke-opacity:1"
       d="M 164.50692,206.66827 H 394.76055"
       id="path1708-5"
       inkscape:connector-curvature="0" />
    <path
       style="fill:none;stroke:#00024d;stroke-width:0.5291667;stroke-linecap:butt;stroke-linejoin:miter;stroke-miterlimit:4;stroke-dasharray:none;stroke-opacity:1"
       d="m 310.16015,51.366246 h 84.89854"
       id="path1708-8-4-8-8"
       inkscape:connector-curvature="0"
       sodipodi:nodetypes="cc" />
    <path
       style="fill:none;stroke:#5600c5;stroke-width:0.5291667;stroke-linecap:butt;stroke-linejoin:miter;stroke-miterlimit:4;stroke-dasharray:none;stroke-opacity:1"
       d="m 303.54557,51.366246 h 6.61458"
       id="path1708-8-4-8-8-3"
       inkscape:connector-curvature="0" />
    <text
       xml:space="preserve"
       style="font-style:normal;font-weight:normal;font-size:10.58333397px;line-height:1.25;font-family:sans-serif;letter-spacing:0px;word-spacing:0px;fill:#000000;fill-opacity:1;stroke:none;stroke-width:0.26458335"
       x="283.36884"
       y="52.803463"
       id="text1817"><tspan
         sodipodi:role="line"
         x="283.36884"
         y="52.803463"
         style="font-style:normal;font-variant:normal;font-weight:normal;font-stretch:normal;font-size:4.23333359px;line-height:10.00000015%;font-family:Karla;-inkscape-font-specification:'Karla, Normal';font-variant-ligatures:normal;font-variant-caps:normal;font-variant-numeric:normal;font-feature-settings:normal;text-align:start;writing-mode:lr-tb;text-anchor:start;stroke-width:0.26458335"
         id="tspan1835">Linux LTS  </tspan></text>
    <g
       id="g2289"
       transform="translate(0.52916683,-1.0821959)">
      <g
         id="g2281">
        <g
           id="g2274">
          <path
             inkscape:connector-curvature="0"
             id="path1708-8-4-8-8-7"
             d="M 264.98958,99.589363 H 353.3154"
             style="fill:none;stroke:#00024d;stroke-width:0.5291667;stroke-linecap:butt;stroke-linejoin:miter;stroke-miterlimit:4;stroke-dasharray:none;stroke-opacity:1"
             sodipodi:nodetypes="cc" />
          <path
             inkscape:connector-curvature="0"
             id="path1708-8-4-8-8-3-9"
             d="m 258.375,99.589363 h 6.61458"
             style="fill:none;stroke:#5e3dcc;stroke-width:0.5291667;stroke-linecap:butt;stroke-linejoin:miter;stroke-miterlimit:4;stroke-dasharray:none;stroke-opacity:1" />
          <text
             id="text1817-4"
             y="101.02658"
             x="238.19821"
             style="font-style:normal;font-weight:normal;font-size:10.58333397px;line-height:1.25;font-family:sans-serif;letter-spacing:0px;word-spacing:0px;fill:#000000;fill-opacity:1;stroke:none;stroke-width:0.26458335"
             xml:space="preserve"><tspan
               id="tspan1835-9"
               style="font-style:normal;font-variant:normal;font-weight:normal;font-stretch:normal;font-size:4.23333359px;line-height:10.00000015%;font-family:Karla;-inkscape-font-specification:'Karla, Normal';font-variant-ligatures:normal;font-variant-caps:normal;font-variant-numeric:normal;font-feature-settings:normal;text-align:start;writing-mode:lr-tb;text-anchor:start;stroke-width:0.26458335"
               y="101.02658"
               x="238.19821"
               sodipodi:role="line">Linux LTS  </tspan></text>
        </g>
      </g>
    </g>
    <text
       xml:space="preserve"
       style="font-style:normal;font-weight:normal;font-size:5.57497501px;line-height:1.25;font-family:sans-serif;letter-spacing:0px;word-spacing:0px;fill:#000000;fill-opacity:1;stroke:none;stroke-width:0.13937439"
       x="119.60258"
       y="-309.08994"
       id="text1262-0-4"
       transform="matrix(0,1.0020354,-0.99796873,0,0,0)"><tspan
         sodipodi:role="line"
         id="tspan1260-8-6"
         x="119.60258"
         y="-309.08994"
         style="font-style:normal;font-variant:normal;font-weight:normal;font-stretch:normal;font-size:5.57497501px;line-height:2;font-family:Karla;-inkscape-font-specification:'Karla, Normal';font-variant-ligatures:normal;font-variant-caps:normal;font-variant-numeric:normal;font-feature-settings:normal;text-align:start;writing-mode:lr-tb;text-anchor:start;stroke-width:0.13937439">- 21.7</tspan><tspan
         sodipodi:role="line"
         x="119.60258"
         y="-297.93997"
         style="font-style:normal;font-variant:normal;font-weight:normal;font-stretch:normal;font-size:5.57497501px;line-height:2;font-family:Karla;-inkscape-font-specification:'Karla, Normal';font-variant-ligatures:normal;font-variant-caps:normal;font-variant-numeric:normal;font-feature-settings:normal;text-align:start;writing-mode:lr-tb;text-anchor:start;stroke-width:0.13937439"
         id="tspan4728">- 21.6</tspan><tspan
         sodipodi:role="line"
         x="119.60258"
         y="-286.79004"
         style="font-style:normal;font-variant:normal;font-weight:normal;font-stretch:normal;font-size:5.57497501px;line-height:2;font-family:Karla;-inkscape-font-specification:'Karla, Normal';font-variant-ligatures:normal;font-variant-caps:normal;font-variant-numeric:normal;font-feature-settings:normal;text-align:start;writing-mode:lr-tb;text-anchor:start;stroke-width:0.13937439"
         id="tspan1264-1-6">- 21.5</tspan><tspan
         sodipodi:role="line"
         x="119.60258"
         y="-275.64008"
         style="font-style:normal;font-variant:normal;font-weight:normal;font-stretch:normal;font-size:5.57497501px;line-height:2;font-family:Karla;-inkscape-font-specification:'Karla, Normal';font-variant-ligatures:normal;font-variant-caps:normal;font-variant-numeric:normal;font-feature-settings:normal;text-align:start;writing-mode:lr-tb;text-anchor:start;stroke-width:0.13937439"
         id="tspan1266-2-0">- 21.4</tspan><tspan
         sodipodi:role="line"
         x="119.60258"
         y="-264.49014"
         style="font-style:normal;font-variant:normal;font-weight:normal;font-stretch:normal;font-size:5.57497501px;line-height:2;font-family:Karla;-inkscape-font-specification:'Karla, Normal';font-variant-ligatures:normal;font-variant-caps:normal;font-variant-numeric:normal;font-feature-settings:normal;text-align:start;writing-mode:lr-tb;text-anchor:start;stroke-width:0.13937439"
         id="tspan1268-2-2">- 21.3</tspan><tspan
         sodipodi:role="line"
         x="119.60258"
         y="-253.34018"
         style="font-style:normal;font-variant:normal;font-weight:normal;font-stretch:normal;font-size:5.57497501px;line-height:2;font-family:Karla;-inkscape-font-specification:'Karla, Normal';font-variant-ligatures:normal;font-variant-caps:normal;font-variant-numeric:normal;font-feature-settings:normal;text-align:start;writing-mode:lr-tb;text-anchor:start;stroke-width:0.13937439"
         id="tspan1270-6-5">- 21.2</tspan><tspan
         sodipodi:role="line"
         x="119.60258"
         y="-242.19023"
         style="font-style:normal;font-variant:normal;font-weight:normal;font-stretch:normal;font-size:5.57497501px;line-height:2;font-family:Karla;-inkscape-font-specification:'Karla, Normal';font-variant-ligatures:normal;font-variant-caps:normal;font-variant-numeric:normal;font-feature-settings:normal;text-align:start;writing-mode:lr-tb;text-anchor:start;stroke-width:0.13937439"
         id="tspan1272-9-8">- 21.1</tspan><tspan
         sodipodi:role="line"
         x="119.60258"
         y="-231.04028"
         style="font-style:normal;font-variant:normal;font-weight:normal;font-stretch:normal;font-size:5.57497501px;line-height:2;font-family:Karla;-inkscape-font-specification:'Karla, Normal';font-variant-ligatures:normal;font-variant-caps:normal;font-variant-numeric:normal;font-feature-settings:normal;text-align:start;writing-mode:lr-tb;text-anchor:start;stroke-width:0.13937439"
         id="tspan1274-1-9">- 21.0</tspan><tspan
         sodipodi:role="line"
         x="119.60258"
         y="-219.89034"
         style="font-style:normal;font-variant:normal;font-weight:normal;font-stretch:normal;font-size:5.57497501px;line-height:2;font-family:Karla;-inkscape-font-specification:'Karla, Normal';font-variant-ligatures:normal;font-variant-caps:normal;font-variant-numeric:normal;font-feature-settings:normal;text-align:start;writing-mode:lr-tb;text-anchor:start;stroke-width:0.13937439"
         id="tspan1276-0-5">- 21preview</tspan><tspan
         sodipodi:role="line"
         x="119.60258"
         y="-208.74039"
         style="font-style:normal;font-variant:normal;font-weight:normal;font-stretch:normal;font-size:5.57497501px;line-height:2;font-family:Karla;-inkscape-font-specification:'Karla, Normal';font-variant-ligatures:normal;font-variant-caps:normal;font-variant-numeric:normal;font-feature-settings:normal;text-align:start;writing-mode:lr-tb;text-anchor:start;stroke-width:0.13937439"
         id="tspan1278-4-0">- 21dev3</tspan><tspan
         sodipodi:role="line"
         x="119.60258"
         y="-197.59044"
         style="font-style:normal;font-variant:normal;font-weight:normal;font-stretch:normal;font-size:5.57497501px;line-height:2;font-family:Karla;-inkscape-font-specification:'Karla, Normal';font-variant-ligatures:normal;font-variant-caps:normal;font-variant-numeric:normal;font-feature-settings:normal;text-align:start;writing-mode:lr-tb;text-anchor:start;stroke-width:0.13937439"
         id="tspan1280-2-6">- 21dev2</tspan><tspan
         sodipodi:role="line"
         x="119.60258"
         y="-186.44049"
         style="font-style:normal;font-variant:normal;font-weight:normal;font-stretch:normal;font-size:5.57497501px;line-height:2;font-family:Karla;-inkscape-font-specification:'Karla, Normal';font-variant-ligatures:normal;font-variant-caps:normal;font-variant-numeric:normal;font-feature-settings:normal;text-align:start;writing-mode:lr-tb;text-anchor:start;stroke-width:0.13937439"
         id="tspan1282-7-0">- 21dev1</tspan><tspan
         sodipodi:role="line"
         x="119.60258"
         y="-175.29053"
         style="font-style:normal;font-variant:normal;font-weight:normal;font-stretch:normal;font-size:5.57497501px;line-height:2;font-family:Karla;-inkscape-font-specification:'Karla, Normal';font-variant-ligatures:normal;font-variant-caps:normal;font-variant-numeric:normal;font-feature-settings:normal;text-align:start;writing-mode:lr-tb;text-anchor:start;stroke-width:0.13937439"
         id="tspan1284-4-8">- 21dev0</tspan></text>
    <path
       style="fill:none;stroke:#000000;stroke-width:0.5291667;stroke-linecap:butt;stroke-linejoin:miter;stroke-miterlimit:4;stroke-dasharray:none;stroke-opacity:1"
       d="m 234.71935,120.17425 h 75.23671"
       id="path1286-0-3"
       inkscape:connector-curvature="0"
       sodipodi:nodetypes="cc" />
    <text
       xml:space="preserve"
       style="font-style:normal;font-weight:normal;font-size:5.58632231px;line-height:1.25;font-family:sans-serif;letter-spacing:0px;word-spacing:0px;fill:#000000;fill-opacity:1;stroke:none;stroke-width:0.13965808"
       x="148.40184"
       y="124.20905"
       id="text1506-7"><tspan
         sodipodi:role="line"
         id="tspan1504-06"
         x="148.40184"
         y="124.20905"
         style="stroke-width:0.13965808">Apertis</tspan><tspan
         sodipodi:role="line"
         x="148.40184"
         y="131.19196"
         style="stroke-width:0.13965808"
         id="tspan1508-9">2021</tspan></text>
    <path
       style="fill:none;stroke:#5e3dcc;stroke-width:0.5291667;stroke-linecap:butt;stroke-linejoin:miter;stroke-miterlimit:4;stroke-dasharray:none;stroke-opacity:1"
       d="m 214.02949,154.96467 h 6.61458"
       id="path1708-8-4-8-8-3-1"
       inkscape:connector-curvature="0" />
    <g
       id="g2150"
       transform="translate(0.52916683,2.3329368)">
      <path
         inkscape:connector-curvature="0"
         id="path1708-8-4-8-8-9"
         d="m 220.11491,152.63174 h 88.70001"
         style="fill:none;stroke:#00024d;stroke-width:0.5291667;stroke-linecap:butt;stroke-linejoin:miter;stroke-miterlimit:4;stroke-dasharray:none;stroke-opacity:1"
         sodipodi:nodetypes="cc" />
      <text
         id="text1817-9"
         y="154.06898"
         x="193.32347"
         style="font-style:normal;font-weight:normal;font-size:10.58333397px;line-height:1.25;font-family:sans-serif;letter-spacing:0px;word-spacing:0px;fill:#000000;fill-opacity:1;stroke:none;stroke-width:0.26458335"
         xml:space="preserve"><tspan
           id="tspan1835-4"
           style="font-style:normal;font-variant:normal;font-weight:normal;font-stretch:normal;font-size:4.23333359px;line-height:10.00000015%;font-family:Karla;-inkscape-font-specification:'Karla, Normal';font-variant-ligatures:normal;font-variant-caps:normal;font-variant-numeric:normal;font-feature-settings:normal;text-align:start;writing-mode:lr-tb;text-anchor:start;stroke-width:0.26458335"
           y="154.06898"
           x="193.32347"
           sodipodi:role="line">Linux LTS  </tspan></text>
    </g>
    <path
       style="fill:none;stroke:#00024d;stroke-width:0.5291667;stroke-linecap:butt;stroke-linejoin:miter;stroke-miterlimit:4;stroke-dasharray:none;stroke-opacity:1"
       d="m 176.42696,198.92066 c 0,0 74.09586,0 88.13873,0"
       id="path1708-8-4-8-8-2"
       inkscape:connector-curvature="0"
       sodipodi:nodetypes="cc" />
    <path
       style="fill:none;stroke:#5e3dcc;stroke-width:0.5291667;stroke-linecap:butt;stroke-linejoin:miter;stroke-miterlimit:4;stroke-dasharray:none;stroke-opacity:1"
       d="m 169.81238,198.92066 h 6.61458"
       id="path1708-8-4-8-8-3-0"
       inkscape:connector-curvature="0" />
    <text
       xml:space="preserve"
       style="font-style:normal;font-weight:normal;font-size:10.58333397px;line-height:1.25;font-family:sans-serif;letter-spacing:0px;word-spacing:0px;fill:#000000;fill-opacity:1;stroke:none;stroke-width:0.26458335"
       x="149.63553"
       y="200.35786"
       id="text1817-6"><tspan
         sodipodi:role="line"
         x="149.63553"
         y="200.35786"
         style="font-style:normal;font-variant:normal;font-weight:normal;font-stretch:normal;font-size:4.23333359px;line-height:10.00000015%;font-family:Karla;-inkscape-font-specification:'Karla, Normal';font-variant-ligatures:normal;font-variant-caps:normal;font-variant-numeric:normal;font-feature-settings:normal;text-align:start;writing-mode:lr-tb;text-anchor:start;stroke-width:0.26458335"
         id="tspan1835-5">Linux LTS  </tspan></text>
    <path
       style="display:inline;fill:none;stroke:#5e3dcc;stroke-width:0.5291667;stroke-linecap:butt;stroke-linejoin:miter;stroke-miterlimit:4;stroke-dasharray:none;stroke-opacity:1"
       d="m 132.22776,206.66827 h 14.1838 18.09536"
       id="path1708-8-4-8-8-3-0-1"
       inkscape:connector-curvature="0"
       sodipodi:nodetypes="ccc" />
    <g
       id="g2132"
       transform="translate(0.52916683,15.440427)">
      <g
         id="g2125">
        <path
           style="fill:none;stroke:#00024d;stroke-width:0.5291667;stroke-linecap:butt;stroke-linejoin:miter;stroke-miterlimit:4;stroke-dasharray:none;stroke-opacity:1"
           d="M 128.69823,247.60859 H 260.9899"
           id="path1708-8-4-8-8-95"
           inkscape:connector-curvature="0" />
        <path
           style="fill:none;stroke:#5e3dcc;stroke-width:0.5291667;stroke-linecap:butt;stroke-linejoin:miter;stroke-miterlimit:4;stroke-dasharray:none;stroke-opacity:1"
           d="m 122.08365,247.60859 h 6.61458"
           id="path1708-8-4-8-8-3-6"
           inkscape:connector-curvature="0" />
        <text
           xml:space="preserve"
           style="font-style:normal;font-weight:normal;font-size:10.58333397px;line-height:1.25;font-family:sans-serif;letter-spacing:0px;word-spacing:0px;fill:#000000;fill-opacity:1;stroke:none;stroke-width:0.26458335"
           x="101.90689"
           y="249.04581"
           id="text1817-1"><tspan
             sodipodi:role="line"
             x="101.90689"
             y="249.04581"
             style="font-style:normal;font-variant:normal;font-weight:normal;font-stretch:normal;font-size:4.23333359px;line-height:10.00000015%;font-family:Karla;-inkscape-font-specification:'Karla, Normal';font-variant-ligatures:normal;font-variant-caps:normal;font-variant-numeric:normal;font-feature-settings:normal;text-align:start;writing-mode:lr-tb;text-anchor:start;stroke-width:0.26458335"
             id="tspan1835-1">Linux LTS  </tspan></text>
      </g>
    </g>
    <text
       xml:space="preserve"
       style="font-style:normal;font-weight:normal;font-size:10.58333397px;line-height:1.25;font-family:sans-serif;letter-spacing:0px;word-spacing:0px;fill:#000000;fill-opacity:1;stroke:none;stroke-width:0.26458335"
       x="100.72533"
       y="289.85629"
       id="text1901"><tspan
         sodipodi:role="line"
         id="tspan1899"
         x="100.72533"
         y="289.85629"
         style="font-style:normal;font-variant:normal;font-weight:normal;font-stretch:normal;font-size:7.05555582px;font-family:sans-serif;-inkscape-font-specification:'sans-serif, Normal';font-variant-ligatures:normal;font-variant-caps:normal;font-variant-numeric:normal;font-feature-settings:normal;text-align:start;writing-mode:lr-tb;text-anchor:start;stroke-width:0.26458335">2018</tspan></text>
    <text
       xml:space="preserve"
       style="font-style:normal;font-weight:normal;font-size:10.58333397px;line-height:1.25;font-family:sans-serif;letter-spacing:0px;word-spacing:0px;fill:#000000;fill-opacity:1;stroke:none;stroke-width:0.26458335"
       x="145.24425"
       y="289.85629"
       id="text1901-4"><tspan
         sodipodi:role="line"
         id="tspan1899-6"
         x="145.24425"
         y="289.85629"
         style="font-style:normal;font-variant:normal;font-weight:normal;font-stretch:normal;font-size:7.05555582px;font-family:sans-serif;-inkscape-font-specification:'sans-serif, Normal';font-variant-ligatures:normal;font-variant-caps:normal;font-variant-numeric:normal;font-feature-settings:normal;text-align:start;writing-mode:lr-tb;text-anchor:start;stroke-width:0.26458335">2019</tspan></text>
    <text
       xml:space="preserve"
       style="font-style:normal;font-weight:normal;font-size:10.58333397px;line-height:1.25;font-family:sans-serif;letter-spacing:0px;word-spacing:0px;fill:#000000;fill-opacity:1;stroke:none;stroke-width:0.26458335"
       x="189.74245"
       y="289.85629"
       id="text1901-6"><tspan
         sodipodi:role="line"
         id="tspan1899-7"
         x="189.74245"
         y="289.85629"
         style="font-style:normal;font-variant:normal;font-weight:normal;font-stretch:normal;font-size:7.05555582px;font-family:sans-serif;-inkscape-font-specification:'sans-serif, Normal';font-variant-ligatures:normal;font-variant-caps:normal;font-variant-numeric:normal;font-feature-settings:normal;text-align:start;writing-mode:lr-tb;text-anchor:start;stroke-width:0.26458335">2020</tspan></text>
    <text
       xml:space="preserve"
       style="font-style:normal;font-weight:normal;font-size:10.58333397px;line-height:1.25;font-family:sans-serif;letter-spacing:0px;word-spacing:0px;fill:#000000;fill-opacity:1;stroke:none;stroke-width:0.26458335"
       x="234.34575"
       y="289.85629"
       id="text1901-2"><tspan
         sodipodi:role="line"
         id="tspan1899-74"
         x="234.34575"
         y="289.85629"
         style="font-style:normal;font-variant:normal;font-weight:normal;font-stretch:normal;font-size:7.05555582px;font-family:sans-serif;-inkscape-font-specification:'sans-serif, Normal';font-variant-ligatures:normal;font-variant-caps:normal;font-variant-numeric:normal;font-feature-settings:normal;text-align:start;writing-mode:lr-tb;text-anchor:start;stroke-width:0.26458335">2021</tspan></text>
    <text
       xml:space="preserve"
       style="font-style:normal;font-weight:normal;font-size:10.58333397px;line-height:1.25;font-family:sans-serif;letter-spacing:0px;word-spacing:0px;fill:#000000;fill-opacity:1;stroke:none;stroke-width:0.26458335"
       x="278.88531"
       y="289.85629"
       id="text1901-1"><tspan
         sodipodi:role="line"
         id="tspan1899-0"
         x="278.88531"
         y="289.85629"
         style="font-style:normal;font-variant:normal;font-weight:normal;font-stretch:normal;font-size:7.05555582px;font-family:sans-serif;-inkscape-font-specification:'sans-serif, Normal';font-variant-ligatures:normal;font-variant-caps:normal;font-variant-numeric:normal;font-feature-settings:normal;text-align:start;writing-mode:lr-tb;text-anchor:start;stroke-width:0.26458335">2022</tspan></text>
    <text
       xml:space="preserve"
       style="font-style:normal;font-weight:normal;font-size:10.58333397px;line-height:1.25;font-family:sans-serif;letter-spacing:0px;word-spacing:0px;fill:#000000;fill-opacity:1;stroke:none;stroke-width:0.26458335"
       x="323.32669"
       y="289.85629"
       id="text1901-0"><tspan
         sodipodi:role="line"
         id="tspan1899-64"
         x="323.32669"
         y="289.85629"
         style="font-style:normal;font-variant:normal;font-weight:normal;font-stretch:normal;font-size:7.05555582px;font-family:sans-serif;-inkscape-font-specification:'sans-serif, Normal';font-variant-ligatures:normal;font-variant-caps:normal;font-variant-numeric:normal;font-feature-settings:normal;text-align:start;writing-mode:lr-tb;text-anchor:start;stroke-width:0.26458335">2023</tspan></text>
    <text
       xml:space="preserve"
       style="font-style:normal;font-weight:normal;font-size:10.58333397px;line-height:1.25;font-family:sans-serif;letter-spacing:0px;word-spacing:0px;fill:#000000;fill-opacity:1;stroke:none;stroke-width:0.26458335"
       x="56.066978"
       y="272.50812"
       id="text2447"><tspan
         sodipodi:role="line"
         id="tspan2445"
         x="56.066978"
         y="272.50812"
         style="font-style:normal;font-variant:normal;font-weight:normal;font-stretch:normal;font-size:4.23333359px;font-family:Karla;-inkscape-font-specification:'Karla, Normal';font-variant-ligatures:normal;font-variant-caps:normal;font-variant-numeric:normal;font-feature-settings:normal;text-align:start;writing-mode:lr-tb;text-anchor:start;stroke-width:0.26458335">Debian</tspan></text>
    <text
       xml:space="preserve"
       style="font-style:normal;font-weight:normal;font-size:10.58333397px;line-height:1.25;font-family:sans-serif;letter-spacing:0px;word-spacing:0px;display:inline;fill:#000000;fill-opacity:1;stroke:none;stroke-width:0.26458335"
       x="117.07947"
       y="208.10548"
       id="text2447-6"><tspan
         sodipodi:role="line"
         id="tspan2445-2"
         x="117.07947"
         y="208.10548"
         style="font-style:normal;font-variant:normal;font-weight:normal;font-stretch:normal;font-size:4.23333359px;font-family:Karla;-inkscape-font-specification:'Karla, Normal';font-variant-ligatures:normal;font-variant-caps:normal;font-variant-numeric:normal;font-feature-settings:normal;text-align:start;writing-mode:lr-tb;text-anchor:start;stroke-width:0.26458335">Debian</tspan></text>
    <path
       style="display:inline;fill:none;stroke:#ff0016;stroke-width:0.5291667;stroke-linecap:butt;stroke-linejoin:miter;stroke-miterlimit:4;stroke-dasharray:none;stroke-opacity:1"
       d="M 253.1247,107.1371 H 420.80437"
       id="path1708-5-3"
       inkscape:connector-curvature="0" />
    <path
       style="display:inline;fill:none;stroke:#5e3dcc;stroke-width:0.5291667;stroke-linecap:butt;stroke-linejoin:miter;stroke-miterlimit:4;stroke-dasharray:none;stroke-opacity:1"
       d="M 220.84543,107.1371 H 253.1247"
       id="path1708-8-4-8-8-3-0-1-4"
       inkscape:connector-curvature="0" />
    <text
       xml:space="preserve"
       style="font-style:normal;font-weight:normal;font-size:10.58333397px;line-height:1.25;font-family:sans-serif;letter-spacing:0px;word-spacing:0px;display:inline;fill:#000000;fill-opacity:1;stroke:none;stroke-width:0.26458335"
       x="205.69708"
       y="108.57433"
       id="text2447-6-24"><tspan
         sodipodi:role="line"
         id="tspan2445-2-5"
         x="205.69708"
         y="108.57433"
         style="font-style:normal;font-variant:normal;font-weight:normal;font-stretch:normal;font-size:4.23333359px;font-family:Karla;-inkscape-font-specification:'Karla, Normal';font-variant-ligatures:normal;font-variant-caps:normal;font-variant-numeric:normal;font-feature-settings:normal;text-align:start;writing-mode:lr-tb;text-anchor:start;stroke-width:0.26458335">Debian</tspan></text>
    <text
       xml:space="preserve"
       style="font-style:normal;font-weight:normal;font-size:10.58333397px;line-height:1.25;font-family:sans-serif;letter-spacing:0px;word-spacing:0px;fill:#000000;fill-opacity:1;stroke:none;stroke-width:0.26458335"
       x="297.84341"
       y="274.64273"
       id="text2558"><tspan
         sodipodi:role="line"
         id="tspan2556"
         x="297.84341"
         y="274.64273"
         style="font-style:normal;font-variant:normal;font-weight:normal;font-stretch:normal;font-size:4.23333359px;font-family:Karla;-inkscape-font-specification:'Karla, Normal';font-variant-ligatures:normal;font-variant-caps:normal;font-variant-numeric:normal;font-feature-settings:normal;text-align:start;writing-mode:lr-tb;text-anchor:start;stroke-width:0.26458335">EOL</tspan></text>
    <text
       xml:space="preserve"
       style="font-style:normal;font-weight:normal;font-size:10.58333397px;line-height:1.25;font-family:sans-serif;letter-spacing:0px;word-spacing:0px;display:inline;fill:#000000;fill-opacity:1;stroke:none;stroke-width:0.26458335"
       x="391.0199"
       y="210.33362"
       id="text2558-1"><tspan
         sodipodi:role="line"
         id="tspan2556-6"
         x="391.0199"
         y="210.33362"
         style="font-style:normal;font-variant:normal;font-weight:normal;font-stretch:normal;font-size:4.23333359px;font-family:Karla;-inkscape-font-specification:'Karla, Normal';font-variant-ligatures:normal;font-variant-caps:normal;font-variant-numeric:normal;font-feature-settings:normal;text-align:start;writing-mode:lr-tb;text-anchor:start;stroke-width:0.26458335">EOL</tspan></text>
    <text
       xml:space="preserve"
       style="font-style:normal;font-weight:normal;font-size:10.58333397px;line-height:1.25;font-family:sans-serif;letter-spacing:0px;word-spacing:0px;display:inline;fill:#000000;fill-opacity:1;stroke:none;stroke-width:0.26458335"
       x="156.2"
       y="210.39977"
       id="text2558-1-8"><tspan
         sodipodi:role="line"
         id="tspan2556-6-8"
         x="156.2"
         y="210.39977"
         style="font-style:normal;font-variant:normal;font-weight:normal;font-stretch:normal;font-size:4.23333359px;font-family:Karla;-inkscape-font-specification:'Karla, Normal';font-variant-ligatures:normal;font-variant-caps:normal;font-variant-numeric:normal;font-feature-settings:normal;text-align:start;writing-mode:lr-tb;text-anchor:start;stroke-width:0.26458335">Release</tspan></text>
    <path
       style="display:inline;fill:none;stroke:#5e3dcc;stroke-width:0.53906852;stroke-linecap:butt;stroke-linejoin:miter;stroke-miterlimit:4;stroke-dasharray:none;stroke-opacity:1"
       d="M 87.220914,227.98445 H 145.3721"
       id="path1286-1"
       inkscape:connector-curvature="0" />
    <path
       style="display:inline;fill:none;stroke:#5e3dcc;stroke-width:0.5291667;stroke-linecap:butt;stroke-linejoin:miter;stroke-miterlimit:4;stroke-dasharray:none;stroke-opacity:1"
       d="m 131.39443,162.65723 h 55.95901"
       id="path1286-0-1"
       inkscape:connector-curvature="0" />
    <path
       style="display:inline;fill:none;stroke:#5e3dcc;stroke-width:0.5291667;stroke-linecap:butt;stroke-linejoin:miter;stroke-miterlimit:4;stroke-dasharray:none;stroke-opacity:1"
       d="m 176.2234,120.17425 h 58.49595"
       id="path1286-0-3-0"
       inkscape:connector-curvature="0"
       sodipodi:nodetypes="cc" />
    <path
       style="display:inline;fill:none;stroke:#5e3dcc;stroke-width:0.5291667;stroke-linecap:butt;stroke-linejoin:miter;stroke-miterlimit:4;stroke-dasharray:none;stroke-opacity:1"
       d="m 220.91851,60.785921 58.41192,-0.09354"
       id="path1286-0-3-2-07"
       inkscape:connector-curvature="0"
       sodipodi:nodetypes="cc" />
    <path
       style="display:inline;fill:none;stroke:#5e3dcc;stroke-width:0.5291667;stroke-linecap:butt;stroke-linejoin:miter;stroke-miterlimit:4;stroke-dasharray:none;stroke-opacity:1"
       d="m 265.27779,13.483061 h 58.435"
       id="path1286-0-3-2-8-0"
       inkscape:connector-curvature="0"
       sodipodi:nodetypes="cc" />
    <tspan
       transform="rotate(90)"
       sodipodi:role="line"
       id="tspan1260-2"
       x="227.56264"
       y="-208.74396"
       style="font-style:normal;font-variant:normal;font-weight:normal;font-stretch:normal;font-size:5.58632231px;line-height:2;font-family:Karla;-inkscape-font-specification:'Karla, Normal';font-variant-ligatures:normal;font-variant-caps:normal;font-variant-numeric:normal;font-feature-settings:normal;text-align:start;letter-spacing:0px;word-spacing:0px;writing-mode:lr-tb;text-anchor:start;display:inline;fill:#000000;fill-opacity:1;stroke:none;stroke-width:0.13965808">- 19.6</tspan>
    <tspan
       transform="rotate(90)"
       sodipodi:role="line"
       id="tspan1260-9"
       x="227.56264"
       y="-208.74396"
       style="font-style:normal;font-variant:normal;font-weight:normal;font-stretch:normal;font-size:5.58632231px;line-height:2;font-family:Karla;-inkscape-font-specification:'Karla, Normal';font-variant-ligatures:normal;font-variant-caps:normal;font-variant-numeric:normal;font-feature-settings:normal;text-align:start;letter-spacing:0px;word-spacing:0px;writing-mode:lr-tb;text-anchor:start;display:inline;fill:#000000;fill-opacity:1;stroke:none;stroke-width:0.13965808">- 19.6</tspan>
    <text
       xml:space="preserve"
       style="font-style:normal;font-weight:normal;font-size:10.58333397px;line-height:1.25;font-family:sans-serif;letter-spacing:0px;word-spacing:0px;fill:#000000;fill-opacity:1;stroke:none;stroke-width:0.26458335"
       x="220.10983"
       y="247.04733"
       id="text4718"><tspan
         sodipodi:role="line"
         id="tspan4716"
         x="220.10983"
         y="256.4111"
         style="stroke-width:0.26458335" /></text>
  </g>
</svg>
