<?xml version="1.0" encoding="UTF-8"?>
<!DOCTYPE svg PUBLIC "-//W3C//DTD SVG 1.1//EN" "http://www.w3.org/Graphics/SVG/1.1/DTD/svg11.dtd">
<svg version="1.2" width="172.03mm" height="89.52mm" viewBox="1999 13650 17203 8952" preserveAspectRatio="xMidYMid" fill-rule="evenodd" stroke-width="28.222" stroke-linejoin="round" xmlns="http://www.w3.org/2000/svg" xmlns:ooo="http://xml.openoffice.org/svg/export" xmlns:xlink="http://www.w3.org/1999/xlink" xmlns:presentation="http://sun.com/xmlns/staroffice/presentation" xmlns:smil="http://www.w3.org/2001/SMIL20/" xmlns:anim="urn:oasis:names:tc:opendocument:xmlns:animation:1.0" xml:space="preserve">
 <defs>
  <font id="EmbeddedFont_1" horiz-adv-x="2048">
   <font-face font-family="Liberation Sans embedded" units-per-em="2048" font-weight="normal" font-style="normal" ascent="1863" descent="445"/>
   <missing-glyph horiz-adv-x="2048" d="M 0,0 L 2047,0 2047,2047 0,2047 0,0 Z"/>
   <glyph unicode="y" horiz-adv-x="1038" d="M 191,-425 C 142,-425 100,-421 67,-414 L 67,-279 C 92,-283 120,-285 151,-285 263,-285 352,-203 417,-38 L 434,5 5,1082 197,1082 425,484 C 428,475 432,464 437,451 442,438 457,394 482,320 507,246 521,205 523,196 L 593,393 830,1082 1020,1082 604,0 C 559,-115 518,-201 479,-258 440,-314 398,-356 351,-384 304,-411 250,-425 191,-425 Z"/>
   <glyph unicode="x" horiz-adv-x="996" d="M 801,0 L 510,444 217,0 23,0 408,556 41,1082 240,1082 510,661 778,1082 979,1082 612,558 1002,0 801,0 Z"/>
   <glyph unicode="w" horiz-adv-x="1525" d="M 1174,0 L 965,0 776,765 740,934 C 734,904 725,861 712,805 699,748 631,480 508,0 L 300,0 -3,1082 175,1082 358,347 C 363,331 377,265 401,149 L 418,223 644,1082 837,1082 1026,339 1072,149 1103,288 1308,1082 1484,1082 1174,0 Z"/>
   <glyph unicode="v" horiz-adv-x="1038" d="M 613,0 L 400,0 7,1082 199,1082 437,378 C 446,351 469,272 506,141 L 541,258 580,376 826,1082 1017,1082 613,0 Z"/>
   <glyph unicode="u" horiz-adv-x="890" d="M 314,1082 L 314,396 C 314,325 321,269 335,230 349,191 371,162 402,145 433,128 478,119 537,119 624,119 692,149 742,208 792,267 817,350 817,455 L 817,1082 997,1082 997,231 C 997,105 999,28 1003,0 L 833,0 C 832,3 832,12 831,27 830,42 830,59 829,78 828,97 826,132 825,185 L 822,185 C 781,110 733,58 679,27 624,-4 557,-20 476,-20 357,-20 271,10 216,69 161,128 133,225 133,361 L 133,1082 314,1082 Z"/>
   <glyph unicode="t" horiz-adv-x="552" d="M 554,8 C 495,-8 434,-16 372,-16 228,-16 156,66 156,229 L 156,951 31,951 31,1082 163,1082 216,1324 336,1324 336,1082 536,1082 536,951 336,951 336,268 C 336,216 345,180 362,159 379,138 408,127 450,127 474,127 509,132 554,141 L 554,8 Z"/>
   <glyph unicode="s" horiz-adv-x="912" d="M 950,299 C 950,197 912,118 835,63 758,8 650,-20 511,-20 376,-20 273,2 200,47 127,91 79,160 57,254 L 216,285 C 231,227 263,185 311,158 359,131 426,117 511,117 602,117 669,131 712,159 754,187 775,229 775,285 775,328 760,362 731,389 702,416 654,438 589,455 L 460,489 C 357,516 283,542 240,568 196,593 162,624 137,661 112,698 100,743 100,796 100,895 135,970 206,1022 276,1073 378,1099 513,1099 632,1099 727,1078 798,1036 868,994 912,927 931,834 L 769,814 C 759,862 732,899 689,925 645,950 586,963 513,963 432,963 372,951 333,926 294,901 275,864 275,814 275,783 283,758 299,738 315,718 339,701 370,687 401,673 467,654 568,629 663,605 732,583 774,563 816,542 849,520 874,495 898,470 917,442 930,410 943,377 950,340 950,299 Z"/>
   <glyph unicode="r" horiz-adv-x="530" d="M 142,0 L 142,830 C 142,906 140,990 136,1082 L 306,1082 C 311,959 314,886 314,861 L 318,861 C 347,954 380,1017 417,1051 454,1085 507,1102 575,1102 599,1102 623,1099 648,1092 L 648,927 C 624,934 592,937 552,937 477,937 420,905 381,841 342,776 322,684 322,564 L 322,0 142,0 Z"/>
   <glyph unicode="p" horiz-adv-x="932" d="M 1053,546 C 1053,169 920,-20 655,-20 488,-20 376,43 319,168 L 314,168 C 317,163 318,106 318,-2 L 318,-425 138,-425 138,861 C 138,972 136,1046 132,1082 L 306,1082 C 307,1079 308,1070 309,1054 310,1037 312,1012 314,978 315,944 316,921 316,908 L 320,908 C 352,975 394,1024 447,1055 500,1086 569,1101 655,1101 788,1101 888,1056 954,967 1020,878 1053,737 1053,546 Z M 864,542 C 864,693 844,800 803,865 762,930 698,962 609,962 538,962 482,947 442,917 401,887 371,840 350,777 329,713 318,630 318,528 318,386 341,281 386,214 431,147 505,113 607,113 696,113 762,146 803,212 844,277 864,387 864,542 Z"/>
   <glyph unicode="o" horiz-adv-x="974" d="M 1053,542 C 1053,353 1011,212 928,119 845,26 724,-20 565,-20 407,-20 288,28 207,125 126,221 86,360 86,542 86,915 248,1102 571,1102 736,1102 858,1057 936,966 1014,875 1053,733 1053,542 Z M 864,542 C 864,691 842,800 798,868 753,935 679,969 574,969 469,969 393,935 346,866 299,797 275,689 275,542 275,399 298,292 345,221 391,149 464,113 563,113 671,113 748,148 795,217 841,286 864,395 864,542 Z"/>
   <glyph unicode="n" horiz-adv-x="890" d="M 825,0 L 825,686 C 825,757 818,813 804,852 790,891 768,920 737,937 706,954 661,963 602,963 515,963 447,933 397,874 347,815 322,732 322,627 L 322,0 142,0 142,851 C 142,977 140,1054 136,1082 L 306,1082 C 307,1079 307,1070 308,1055 309,1040 310,1024 311,1005 312,986 313,950 314,897 L 317,897 C 358,972 406,1025 461,1056 515,1087 582,1102 663,1102 782,1102 869,1073 924,1014 979,955 1006,857 1006,721 L 1006,0 825,0 Z"/>
   <glyph unicode="m" horiz-adv-x="1462" d="M 768,0 L 768,686 C 768,791 754,863 725,903 696,943 645,963 570,963 493,963 433,934 388,875 343,816 321,734 321,627 L 321,0 142,0 142,851 C 142,977 140,1054 136,1082 L 306,1082 C 307,1079 307,1070 308,1055 309,1040 310,1024 311,1005 312,986 313,950 314,897 L 317,897 C 356,974 400,1027 450,1057 500,1087 561,1102 633,1102 715,1102 780,1086 828,1053 875,1020 908,968 927,897 L 930,897 C 967,970 1013,1022 1066,1054 1119,1086 1183,1102 1258,1102 1367,1102 1447,1072 1497,1013 1546,954 1571,856 1571,721 L 1571,0 1393,0 1393,686 C 1393,791 1379,863 1350,903 1321,943 1270,963 1195,963 1116,963 1055,934 1012,876 968,817 946,734 946,627 L 946,0 768,0 Z"/>
   <glyph unicode="l" horiz-adv-x="213" d="M 138,0 L 138,1484 318,1484 318,0 138,0 Z"/>
   <glyph unicode="i" horiz-adv-x="213" d="M 137,1312 L 137,1484 317,1484 317,1312 137,1312 Z M 137,0 L 137,1082 317,1082 317,0 137,0 Z"/>
   <glyph unicode="e" horiz-adv-x="974" d="M 276,503 C 276,379 302,283 353,216 404,149 479,115 578,115 656,115 719,131 766,162 813,193 844,233 861,281 L 1019,236 C 954,65 807,-20 578,-20 418,-20 296,28 213,123 129,218 87,360 87,548 87,727 129,864 213,959 296,1054 416,1102 571,1102 889,1102 1048,910 1048,527 L 1048,503 276,503 Z M 862,641 C 852,755 823,838 775,891 727,943 658,969 568,969 481,969 412,940 361,882 310,823 282,743 278,641 L 862,641 Z"/>
   <glyph unicode="d" horiz-adv-x="932" d="M 821,174 C 788,105 744,55 689,25 634,-5 565,-20 484,-20 347,-20 247,26 183,118 118,210 86,349 86,536 86,913 219,1102 484,1102 566,1102 634,1087 689,1057 744,1027 788,979 821,914 L 823,914 821,1035 821,1484 1001,1484 1001,223 C 1001,110 1003,36 1007,0 L 835,0 C 833,11 831,35 829,74 826,113 825,146 825,174 L 821,174 Z M 275,542 C 275,391 295,282 335,217 375,152 440,119 530,119 632,119 706,154 752,225 798,296 821,405 821,554 821,697 798,802 752,869 706,936 633,969 532,969 441,969 376,936 336,869 295,802 275,693 275,542 Z"/>
   <glyph unicode="c" horiz-adv-x="890" d="M 275,546 C 275,402 298,295 343,226 388,157 457,122 548,122 612,122 666,139 709,174 752,209 778,262 788,334 L 970,322 C 956,218 912,135 837,73 762,11 668,-20 553,-20 402,-20 286,28 207,124 127,219 87,359 87,542 87,724 127,863 207,959 287,1054 402,1102 551,1102 662,1102 754,1073 827,1016 900,959 945,880 964,779 L 779,765 C 770,825 746,873 708,908 670,943 616,961 546,961 451,961 382,929 339,866 296,803 275,696 275,546 Z"/>
   <glyph unicode="a" horiz-adv-x="1059" d="M 414,-20 C 305,-20 224,9 169,66 114,123 87,202 87,302 87,414 124,500 198,560 271,620 390,652 554,656 L 797,660 797,719 C 797,807 778,870 741,908 704,946 645,965 565,965 484,965 426,951 389,924 352,897 330,853 323,793 L 135,810 C 166,1005 310,1102 569,1102 705,1102 807,1071 876,1009 945,946 979,856 979,738 L 979,272 C 979,219 986,179 1000,152 1014,125 1041,111 1080,111 1097,111 1117,113 1139,118 L 1139,6 C 1094,-5 1047,-10 1000,-10 933,-10 885,8 855,43 824,78 807,132 803,207 L 797,207 C 751,124 698,66 637,32 576,-3 501,-20 414,-20 Z M 455,115 C 521,115 580,130 631,160 682,190 723,231 753,284 782,336 797,390 797,445 L 797,534 600,530 C 515,529 451,520 408,504 364,488 330,463 307,430 284,397 272,353 272,299 272,240 288,195 320,163 351,131 396,115 455,115 Z"/>
   <glyph unicode="T" horiz-adv-x="1187" d="M 720,1253 L 720,0 530,0 530,1253 46,1253 46,1409 1204,1409 1204,1253 720,1253 Z"/>
   <glyph unicode="S" horiz-adv-x="1207" d="M 1272,389 C 1272,259 1221,158 1120,87 1018,16 875,-20 690,-20 347,-20 148,99 93,338 L 278,375 C 299,290 345,228 414,189 483,149 578,129 697,129 820,129 916,150 983,193 1050,235 1083,297 1083,379 1083,425 1073,462 1052,491 1031,520 1001,543 963,562 925,581 880,596 827,609 774,622 716,635 652,650 541,675 456,699 399,724 341,749 295,776 262,807 229,837 203,872 186,913 168,954 159,1000 159,1053 159,1174 205,1267 298,1332 390,1397 522,1430 694,1430 854,1430 976,1406 1061,1357 1146,1308 1205,1224 1239,1106 L 1051,1073 C 1030,1148 991,1202 933,1236 875,1269 795,1286 692,1286 579,1286 493,1267 434,1230 375,1193 345,1137 345,1063 345,1020 357,984 380,956 403,927 436,903 479,884 522,864 609,840 738,811 781,801 825,791 868,781 911,770 952,758 991,744 1030,729 1067,712 1102,693 1136,674 1166,650 1191,622 1216,594 1236,561 1251,523 1265,485 1272,440 1272,389 Z"/>
   <glyph unicode="R" horiz-adv-x="1250" d="M 1164,0 L 798,585 359,585 359,0 168,0 168,1409 831,1409 C 990,1409 1112,1374 1199,1303 1285,1232 1328,1133 1328,1006 1328,901 1298,813 1237,742 1176,671 1091,626 984,607 L 1384,0 1164,0 Z M 1136,1004 C 1136,1086 1108,1149 1053,1192 997,1235 917,1256 812,1256 L 359,1256 359,736 820,736 C 921,736 999,760 1054,807 1109,854 1136,919 1136,1004 Z"/>
   <glyph unicode="P" horiz-adv-x="1123" d="M 1258,985 C 1258,852 1215,746 1128,667 1041,588 922,549 773,549 L 359,549 359,0 168,0 168,1409 761,1409 C 919,1409 1041,1372 1128,1298 1215,1224 1258,1120 1258,985 Z M 1066,983 C 1066,1165 957,1256 738,1256 L 359,1256 359,700 746,700 C 959,700 1066,794 1066,983 Z"/>
   <glyph unicode="O" horiz-adv-x="1419" d="M 1495,711 C 1495,564 1467,435 1411,324 1354,213 1273,128 1168,69 1063,10 938,-20 795,-20 650,-20 526,9 421,68 316,127 235,212 180,323 125,434 97,563 97,711 97,936 159,1113 282,1240 405,1367 577,1430 797,1430 940,1430 1065,1402 1170,1345 1275,1288 1356,1205 1412,1096 1467,987 1495,859 1495,711 Z M 1300,711 C 1300,886 1256,1024 1169,1124 1081,1224 957,1274 797,1274 636,1274 511,1225 423,1126 335,1027 291,889 291,711 291,534 336,394 425,291 514,187 637,135 795,135 958,135 1083,185 1170,286 1257,386 1300,528 1300,711 Z"/>
   <glyph unicode="M" horiz-adv-x="1398" d="M 1366,0 L 1366,940 C 1366,1044 1369,1144 1375,1240 1342,1121 1313,1027 1287,960 L 923,0 789,0 420,960 364,1130 331,1240 334,1129 338,940 338,0 168,0 168,1409 419,1409 794,432 C 807,393 820,351 833,306 845,261 853,228 857,208 862,235 874,275 891,330 908,384 919,418 925,432 L 1293,1409 1538,1409 1538,0 1366,0 Z"/>
   <glyph unicode="L" horiz-adv-x="933" d="M 168,0 L 168,1409 359,1409 359,156 1071,156 1071,0 168,0 Z"/>
   <glyph unicode="K" horiz-adv-x="1208" d="M 1106,0 L 543,680 359,540 359,0 168,0 168,1409 359,1409 359,703 1038,1409 1263,1409 663,797 1343,0 1106,0 Z"/>
   <glyph unicode="I" horiz-adv-x="213" d="M 189,0 L 189,1409 380,1409 380,0 189,0 Z"/>
   <glyph unicode="H" horiz-adv-x="1187" d="M 1121,0 L 1121,653 359,653 359,0 168,0 168,1409 359,1409 359,813 1121,813 1121,1409 1312,1409 1312,0 1121,0 Z"/>
   <glyph unicode="F" horiz-adv-x="1038" d="M 359,1253 L 359,729 1145,729 1145,571 359,571 359,0 168,0 168,1409 1169,1409 1169,1253 359,1253 Z"/>
   <glyph unicode="E" horiz-adv-x="1144" d="M 168,0 L 168,1409 1237,1409 1237,1253 359,1253 359,801 1177,801 1177,647 359,647 359,156 1278,156 1278,0 168,0 Z"/>
   <glyph unicode="C" horiz-adv-x="1334" d="M 792,1274 C 636,1274 515,1224 428,1124 341,1023 298,886 298,711 298,538 343,400 434,295 524,190 646,137 800,137 997,137 1146,235 1245,430 L 1401,352 C 1343,231 1262,138 1157,75 1052,12 930,-20 791,-20 649,-20 526,10 423,69 319,128 240,212 186,322 131,431 104,561 104,711 104,936 165,1112 286,1239 407,1366 575,1430 790,1430 940,1430 1065,1401 1166,1342 1267,1283 1341,1196 1388,1081 L 1207,1021 C 1174,1103 1122,1166 1050,1209 977,1252 891,1274 792,1274 Z"/>
   <glyph unicode="A" horiz-adv-x="1377" d="M 1167,0 L 1006,412 364,412 202,0 4,0 579,1409 796,1409 1362,0 1167,0 Z M 685,1265 L 676,1237 C 659,1182 635,1111 602,1024 L 422,561 949,561 768,1026 C 749,1072 731,1124 712,1182 L 685,1265 Z"/>
   <glyph unicode="-" horiz-adv-x="509" d="M 91,464 L 91,624 591,624 591,464 91,464 Z"/>
   <glyph unicode=" " horiz-adv-x="572"/>
  </font>
 </defs>
 <defs class="EmbeddedBulletChars">
  <g id="bullet-char-template-57356" transform="scale(0.00048828125,-0.00048828125)">
   <path d="M 580,1141 L 1163,571 580,0 -4,571 580,1141 Z"/>
  </g>
  <g id="bullet-char-template-57354" transform="scale(0.00048828125,-0.00048828125)">
   <path d="M 8,1128 L 1137,1128 1137,0 8,0 8,1128 Z"/>
  </g>
  <g id="bullet-char-template-10146" transform="scale(0.00048828125,-0.00048828125)">
   <path d="M 174,0 L 602,739 174,1481 1456,739 174,0 Z M 1358,739 L 309,1346 659,739 1358,739 Z"/>
  </g>
  <g id="bullet-char-template-10132" transform="scale(0.00048828125,-0.00048828125)">
   <path d="M 2015,739 L 1276,0 717,0 1260,543 174,543 174,936 1260,936 717,1481 1274,1481 2015,739 Z"/>
  </g>
  <g id="bullet-char-template-10007" transform="scale(0.00048828125,-0.00048828125)">
   <path d="M 0,-2 C -7,14 -16,27 -25,37 L 356,567 C 262,823 215,952 215,954 215,979 228,992 255,992 264,992 276,990 289,987 310,991 331,999 354,1012 L 381,999 492,748 772,1049 836,1024 860,1049 C 881,1039 901,1025 922,1006 886,937 835,863 770,784 769,783 710,716 594,584 L 774,223 C 774,196 753,168 711,139 L 727,119 C 717,90 699,76 672,76 641,76 570,178 457,381 L 164,-76 C 142,-110 111,-127 72,-127 30,-127 9,-110 8,-76 1,-67 -2,-52 -2,-32 -2,-23 -1,-13 0,-2 Z"/>
  </g>
  <g id="bullet-char-template-10004" transform="scale(0.00048828125,-0.00048828125)">
   <path d="M 285,-33 C 182,-33 111,30 74,156 52,228 41,333 41,471 41,549 55,616 82,672 116,743 169,778 240,778 293,778 328,747 346,684 L 369,508 C 377,444 397,411 428,410 L 1163,1116 C 1174,1127 1196,1133 1229,1133 1271,1133 1292,1118 1292,1087 L 1292,965 C 1292,929 1282,901 1262,881 L 442,47 C 390,-6 338,-33 285,-33 Z"/>
  </g>
  <g id="bullet-char-template-9679" transform="scale(0.00048828125,-0.00048828125)">
   <path d="M 813,0 C 632,0 489,54 383,161 276,268 223,411 223,592 223,773 276,916 383,1023 489,1130 632,1184 813,1184 992,1184 1136,1130 1245,1023 1353,916 1407,772 1407,592 1407,412 1353,268 1245,161 1136,54 992,0 813,0 Z"/>
  </g>
  <g id="bullet-char-template-8226" transform="scale(0.00048828125,-0.00048828125)">
   <path d="M 346,457 C 273,457 209,483 155,535 101,586 74,649 74,723 74,796 101,859 155,911 209,963 273,989 346,989 419,989 480,963 531,910 582,859 608,796 608,723 608,648 583,586 532,535 482,483 420,457 346,457 Z"/>
  </g>
  <g id="bullet-char-template-8211" transform="scale(0.00048828125,-0.00048828125)">
   <path d="M -4,459 L 1135,459 1135,606 -4,606 -4,459 Z"/>
  </g>
  <g id="bullet-char-template-61548" transform="scale(0.00048828125,-0.00048828125)">
   <path d="M 173,740 C 173,903 231,1043 346,1159 462,1274 601,1332 765,1332 928,1332 1067,1274 1183,1159 1299,1043 1357,903 1357,740 1357,577 1299,437 1183,322 1067,206 928,148 765,148 601,148 462,206 346,322 231,437 173,577 173,740 Z"/>
  </g>
 </defs>
 <g class="Page">
  <g class="com.sun.star.drawing.CustomShape">
   <g id="id3">
    <rect class="BoundingBox" stroke="none" fill="none" x="15399" y="19099" width="3803" height="2327"/>
    <path fill="rgb(58,90,128)" stroke="none" d="M 17300,21424 L 15400,21424 15400,19100 19200,19100 19200,21424 17300,21424 Z"/>
    <path fill="none" stroke="rgb(0,0,0)" d="M 17300,21424 L 15400,21424 15400,19100 19200,19100 19200,21424 17300,21424 Z"/>
    <text class="TextShape"><tspan class="TextParagraph" font-family="Liberation Sans, sans-serif" font-size="635px" font-weight="400"><tspan class="TextPosition" x="16117" y="20127"><tspan fill="rgb(255,255,255)" stroke="none">OP-TEE</tspan></tspan></tspan><tspan class="TextParagraph" font-family="Liberation Sans, sans-serif" font-size="635px" font-weight="400"><tspan class="TextPosition" x="16015" y="20838"><tspan fill="rgb(255,255,255)" stroke="none">Common</tspan></tspan></tspan></text>
   </g>
  </g>
  <g class="com.sun.star.drawing.CustomShape">
   <g id="id4">
    <rect class="BoundingBox" stroke="none" fill="none" x="1999" y="20199" width="13003" height="1203"/>
    <path fill="rgb(65,65,65)" stroke="none" d="M 8500,21400 L 2000,21400 2000,20200 15000,20200 15000,21400 8500,21400 Z"/>
    <path fill="none" stroke="rgb(0,0,0)" d="M 8500,21400 L 2000,21400 2000,20200 15000,20200 15000,21400 8500,21400 Z"/>
    <text class="TextShape"><tspan class="TextParagraph" font-family="Liberation Sans, sans-serif" font-size="635px" font-weight="400"><tspan class="TextPosition" x="4764" y="21021"><tspan fill="rgb(255,255,255)" stroke="none">Hypervisor                         </tspan></tspan></tspan></text>
   </g>
  </g>
  <g class="com.sun.star.drawing.CustomShape">
   <g id="id5">
    <rect class="BoundingBox" stroke="none" fill="none" x="6299" y="14399" width="3903" height="2103"/>
    <path fill="rgb(230,125,30)" stroke="none" d="M 8250,16500 L 6300,16500 6300,14400 10200,14400 10200,16500 8250,16500 Z"/>
    <path fill="none" stroke="rgb(0,0,0)" d="M 8250,16500 L 6300,16500 6300,14400 10200,14400 10200,16500 8250,16500 Z"/>
    <text class="TextShape"><tspan class="TextParagraph" font-family="Liberation Sans, sans-serif" font-size="635px" font-weight="400"><tspan class="TextPosition" x="6703" y="15671"><tspan fill="rgb(0,0,0)" stroke="none">Application</tspan></tspan></tspan></text>
   </g>
  </g>
  <g class="com.sun.star.drawing.CustomShape">
   <g id="id6">
    <rect class="BoundingBox" stroke="none" fill="none" x="10599" y="14399" width="4403" height="2103"/>
    <path fill="rgb(130,90,155)" stroke="none" d="M 12800,16500 L 10600,16500 10600,14400 15000,14400 15000,16500 12800,16500 Z"/>
    <path fill="none" stroke="rgb(0,0,0)" d="M 12800,16500 L 10600,16500 10600,14400 15000,14400 15000,16500 12800,16500 Z"/>
    <text class="TextShape"><tspan class="TextParagraph" font-family="Liberation Sans, sans-serif" font-size="635px" font-weight="400"><tspan class="TextPosition" x="12182" y="15315"><tspan fill="rgb(0,0,0)" stroke="none">TEE</tspan></tspan></tspan><tspan class="TextParagraph" font-family="Liberation Sans, sans-serif" font-size="635px" font-weight="400"><tspan class="TextPosition" x="11990" y="16026"><tspan fill="rgb(0,0,0)" stroke="none">Proxy</tspan></tspan></tspan></text>
   </g>
  </g>
  <g class="com.sun.star.drawing.CustomShape">
   <g id="id7">
    <rect class="BoundingBox" stroke="none" fill="none" x="10599" y="17799" width="4403" height="2403"/>
    <path fill="rgb(90,90,90)" stroke="none" d="M 12800,20200 L 10600,20200 10600,17800 15000,17800 15000,20200 12800,20200 Z"/>
    <path fill="none" stroke="rgb(0,0,0)" d="M 12800,20200 L 10600,20200 10600,17800 15000,17800 15000,20200 12800,20200 Z"/>
    <text class="TextShape"><tspan class="TextParagraph" font-family="Liberation Sans, sans-serif" font-size="635px" font-weight="400"><tspan class="TextPosition" x="10978" y="18865"><tspan fill="rgb(255,255,255)" stroke="none">Linux            </tspan></tspan></tspan><tspan class="TextParagraph" font-family="Liberation Sans, sans-serif" font-size="635px" font-weight="400"><tspan class="TextPosition" x="10819" y="19576"><tspan fill="rgb(255,255,255)" stroke="none">Kernel            </tspan></tspan></tspan></text>
   </g>
  </g>
  <g class="com.sun.star.drawing.CustomShape">
   <g id="id8">
    <rect class="BoundingBox" stroke="none" fill="none" x="12899" y="17999" width="1903" height="1003"/>
    <path fill="rgb(190,190,190)" stroke="none" d="M 13850,19000 L 12900,19000 12900,18000 14800,18000 14800,19000 13850,19000 Z"/>
    <path fill="none" stroke="rgb(0,0,0)" d="M 13850,19000 L 12900,19000 12900,18000 14800,18000 14800,19000 13850,19000 Z"/>
    <text class="TextShape"><tspan class="TextParagraph" font-family="Liberation Sans, sans-serif" font-size="635px" font-weight="400"><tspan class="TextPosition" x="13232" y="18721"><tspan fill="rgb(0,0,0)" stroke="none">TEE</tspan></tspan></tspan></text>
   </g>
  </g>
  <g class="com.sun.star.drawing.CustomShape">
   <g id="id9">
    <rect class="BoundingBox" stroke="none" fill="none" x="10599" y="16499" width="4403" height="1303"/>
    <path fill="rgb(58,90,128)" stroke="none" d="M 12800,17800 L 10600,17800 10600,16500 15000,16500 15000,17800 12800,17800 Z"/>
    <path fill="none" stroke="rgb(0,0,0)" d="M 12800,17800 L 10600,17800 10600,16500 15000,16500 15000,17800 12800,17800 Z"/>
    <text class="TextShape"><tspan class="TextParagraph" font-family="Liberation Sans, sans-serif" font-size="635px" font-weight="400"><tspan class="TextPosition" x="10702" y="17371"><tspan fill="rgb(255,255,255)" stroke="none">TEE Client API</tspan></tspan></tspan></text>
   </g>
  </g>
  <g class="com.sun.star.drawing.CustomShape">
   <g id="id10">
    <rect class="BoundingBox" stroke="none" fill="none" x="12899" y="18999" width="1903" height="1003"/>
    <path fill="rgb(58,90,128)" stroke="none" d="M 13850,20000 L 12900,20000 12900,19000 14800,19000 14800,20000 13850,20000 Z"/>
    <path fill="none" stroke="rgb(0,0,0)" d="M 13850,20000 L 12900,20000 12900,19000 14800,19000 14800,20000 13850,20000 Z"/>
    <text class="TextShape"><tspan class="TextParagraph" font-family="Liberation Sans, sans-serif" font-size="635px" font-weight="400"><tspan class="TextPosition" x="13058" y="19721"><tspan fill="rgb(255,255,255)" stroke="none">driver</tspan></tspan></tspan></text>
   </g>
  </g>
  <g class="com.sun.star.drawing.CustomShape">
   <g id="id11">
    <rect class="BoundingBox" stroke="none" fill="none" x="15399" y="16499" width="3803" height="1303"/>
    <path fill="rgb(58,90,128)" stroke="none" d="M 17300,17800 L 15400,17800 15400,16500 19200,16500 19200,17800 17300,17800 Z"/>
    <path fill="none" stroke="rgb(0,0,0)" d="M 17300,17800 L 15400,17800 15400,16500 19200,16500 19200,17800 17300,17800 Z"/>
    <text class="TextShape"><tspan class="TextParagraph" font-family="Liberation Sans, sans-serif" font-size="635px" font-weight="400"><tspan class="TextPosition" x="15662" y="17371"><tspan fill="rgb(255,255,255)" stroke="none">Internal API</tspan></tspan></tspan></text>
   </g>
  </g>
  <g class="com.sun.star.drawing.LineShape">
   <g id="id12">
    <rect class="BoundingBox" stroke="none" fill="none" x="15150" y="13650" width="101" height="7825"/>
    <path fill="none" stroke="rgb(190,190,190)" stroke-width="100" stroke-linejoin="round" d="M 15200,21424 L 15200,13700"/>
   </g>
  </g>
  <g class="com.sun.star.drawing.CustomShape">
   <g id="id13">
    <rect class="BoundingBox" stroke="none" fill="none" x="1999" y="21399" width="17203" height="1203"/>
    <path fill="rgb(65,65,65)" stroke="none" d="M 10600,22600 L 2000,22600 2000,21400 19200,21400 19200,22600 10600,22600 Z"/>
    <path fill="none" stroke="rgb(0,0,0)" d="M 10600,22600 L 2000,22600 2000,21400 19200,21400 19200,22600 10600,22600 Z"/>
    <text class="TextShape"><tspan class="TextParagraph" font-family="Liberation Sans, sans-serif" font-size="635px" font-weight="400"><tspan class="TextPosition" x="7341" y="22221"><tspan fill="rgb(255,255,255)" stroke="none">ARM Trusted Firmware</tspan></tspan></tspan></text>
   </g>
  </g>
  <g class="com.sun.star.drawing.LineShape">
   <g id="id14">
    <rect class="BoundingBox" stroke="none" fill="none" x="10350" y="13650" width="101" height="6601"/>
    <path fill="none" stroke="rgb(190,190,190)" stroke-width="100" stroke-linejoin="round" d="M 10400,20200 L 10400,13700"/>
   </g>
  </g>
  <g class="com.sun.star.drawing.CustomShape">
   <g id="id15">
    <rect class="BoundingBox" stroke="none" fill="none" x="12199" y="20299" width="2703" height="1003"/>
    <path fill="rgb(190,190,190)" stroke="none" d="M 13550,21300 L 12200,21300 12200,20300 14900,20300 14900,21300 13550,21300 Z"/>
    <path fill="none" stroke="rgb(0,0,0)" d="M 13550,21300 L 12200,21300 12200,20300 14900,20300 14900,21300 13550,21300 Z"/>
    <text class="TextShape"><tspan class="TextParagraph" font-family="Liberation Sans, sans-serif" font-size="635px" font-weight="400"><tspan class="TextPosition" x="12318" y="21021"><tspan fill="rgb(0,0,0)" stroke="none">Mediator</tspan></tspan></tspan></text>
   </g>
  </g>
  <g class="com.sun.star.drawing.CustomShape">
   <g id="id16">
    <rect class="BoundingBox" stroke="none" fill="none" x="15399" y="17799" width="3803" height="1303"/>
    <path fill="rgb(58,90,128)" stroke="none" d="M 17300,19100 L 15400,19100 15400,17800 19200,17800 19200,19100 17300,19100 Z"/>
    <path fill="none" stroke="rgb(0,0,0)" d="M 17300,19100 L 15400,19100 15400,17800 19200,17800 19200,19100 17300,19100 Z"/>
    <text class="TextShape"><tspan class="TextParagraph" font-family="Liberation Sans, sans-serif" font-size="635px" font-weight="400"><tspan class="TextPosition" x="15501" y="18671"><tspan fill="rgb(255,255,255)" stroke="none">TEE Context</tspan></tspan></tspan></text>
   </g>
  </g>
  <g class="com.sun.star.drawing.LineShape">
   <g id="id17">
    <rect class="BoundingBox" stroke="none" fill="none" x="6050" y="13650" width="101" height="6601"/>
    <path fill="none" stroke="rgb(190,190,190)" stroke-width="100" stroke-linejoin="round" d="M 6100,20200 L 6100,13700"/>
   </g>
  </g>
  <g class="com.sun.star.drawing.CustomShape">
   <g id="id18">
    <rect class="BoundingBox" stroke="none" fill="none" x="6299" y="16499" width="3903" height="3703"/>
    <path fill="rgb(90,90,90)" stroke="none" d="M 8250,20200 L 6300,20200 6300,16500 10200,16500 10200,20200 8250,20200 Z"/>
    <path fill="none" stroke="rgb(0,0,0)" d="M 8250,20200 L 6300,20200 6300,16500 10200,16500 10200,20200 8250,20200 Z"/>
    <text class="TextShape"><tspan class="TextParagraph" font-family="Liberation Sans, sans-serif" font-size="635px" font-weight="400"><tspan class="TextPosition" x="6665" y="18215"><tspan fill="rgb(255,255,255)" stroke="none">Alternative </tspan></tspan></tspan><tspan class="TextParagraph" font-family="Liberation Sans, sans-serif" font-size="635px" font-weight="400"><tspan class="TextPosition" x="7791" y="18926"><tspan fill="rgb(255,255,255)" stroke="none">OS</tspan></tspan></tspan></text>
   </g>
  </g>
  <g class="com.sun.star.drawing.CustomShape">
   <g id="id19">
    <rect class="BoundingBox" stroke="none" fill="none" x="1999" y="16499" width="3903" height="3703"/>
    <path fill="rgb(90,90,90)" stroke="none" d="M 3950,20200 L 2000,20200 2000,16500 5900,16500 5900,20200 3950,20200 Z"/>
    <path fill="none" stroke="rgb(0,0,0)" d="M 3950,20200 L 2000,20200 2000,16500 5900,16500 5900,20200 3950,20200 Z"/>
    <text class="TextShape"><tspan class="TextParagraph" font-family="Liberation Sans, sans-serif" font-size="635px" font-weight="400"><tspan class="TextPosition" x="2365" y="18215"><tspan fill="rgb(255,255,255)" stroke="none">Alternative </tspan></tspan></tspan><tspan class="TextParagraph" font-family="Liberation Sans, sans-serif" font-size="635px" font-weight="400"><tspan class="TextPosition" x="3491" y="18926"><tspan fill="rgb(255,255,255)" stroke="none">OS</tspan></tspan></tspan></text>
   </g>
  </g>
  <g class="com.sun.star.drawing.CustomShape">
   <g id="id20">
    <rect class="BoundingBox" stroke="none" fill="none" x="15399" y="14399" width="3803" height="2103"/>
    <path fill="rgb(230,125,30)" stroke="none" d="M 17300,16500 L 15400,16500 15400,14400 19200,14400 19200,16500 17300,16500 Z"/>
    <path fill="none" stroke="rgb(0,0,0)" d="M 17300,16500 L 15400,16500 15400,14400 19200,14400 19200,16500 17300,16500 Z"/>
    <text class="TextShape"><tspan class="TextParagraph" font-family="Liberation Sans, sans-serif" font-size="635px" font-weight="400"><tspan class="TextPosition" x="16238" y="15315"><tspan fill="rgb(0,0,0)" stroke="none">Trusted</tspan></tspan></tspan><tspan class="TextParagraph" font-family="Liberation Sans, sans-serif" font-size="635px" font-weight="400"><tspan class="TextPosition" x="15753" y="16026"><tspan fill="rgb(0,0,0)" stroke="none">Application</tspan></tspan></tspan></text>
   </g>
  </g>
  <g class="com.sun.star.drawing.ConnectorShape">
   <g id="id21">
    <rect class="BoundingBox" stroke="none" fill="none" x="7962" y="16500" width="3980" height="4589"/>
    <g style="opacity: 0.698039215686274">
     <path fill="none" stroke="rgb(255,51,51)" stroke-width="200" stroke-linejoin="round" d="M 11691,17002 C 11498,22307 8476,22306 8261,17061"/>
     <path fill="rgb(255,51,51)" stroke="none" d="M 11441,16995 L 11700,16500 11940,17005 11441,16995 Z"/>
     <path fill="rgb(255,51,51)" stroke="none" d="M 7963,17106 L 8250,16500 8563,17093 7963,17106 Z"/>
    </g>
   </g>
  </g>
  <g class="com.sun.star.drawing.ConnectorShape">
   <g id="id22">
    <rect class="BoundingBox" stroke="none" fill="none" x="13655" y="16500" width="3939" height="5739"/>
    <g style="opacity: 0.698039215686274">
     <path fill="none" stroke="rgb(255,51,51)" stroke-width="200" stroke-linejoin="round" d="M 13906,17006 C 14058,23840 17125,23839 17293,17058"/>
     <path fill="rgb(255,51,51)" stroke="none" d="M 13656,17003 L 13900,16500 14156,16997 13656,17003 Z"/>
     <path fill="rgb(255,51,51)" stroke="none" d="M 16992,17096 L 17300,16500 17592,17104 16992,17096 Z"/>
    </g>
   </g>
  </g>
  <g class="com.sun.star.drawing.CustomShape">
   <g id="id23">
    <rect class="BoundingBox" stroke="none" fill="none" x="1999" y="14399" width="3903" height="2103"/>
    <path fill="rgb(230,125,30)" stroke="none" d="M 3950,16500 L 2000,16500 2000,14400 5900,14400 5900,16500 3950,16500 Z"/>
    <path fill="none" stroke="rgb(0,0,0)" d="M 3950,16500 L 2000,16500 2000,14400 5900,14400 5900,16500 3950,16500 Z"/>
    <text class="TextShape"><tspan class="TextParagraph" font-family="Liberation Sans, sans-serif" font-size="635px" font-weight="400"><tspan class="TextPosition" x="2403" y="15671"><tspan fill="rgb(0,0,0)" stroke="none">Application</tspan></tspan></tspan></text>
   </g>
  </g>
 </g>
</svg>