<?xml version="1.0" encoding="UTF-8" standalone="no"?>
<svg
   xmlns:dc="http://purl.org/dc/elements/1.1/"
   xmlns:cc="http://creativecommons.org/ns#"
   xmlns:rdf="http://www.w3.org/1999/02/22-rdf-syntax-ns#"
   xmlns:svg="http://www.w3.org/2000/svg"
   xmlns="http://www.w3.org/2000/svg"
   xmlns:sodipodi="http://sodipodi.sourceforge.net/DTD/sodipodi-0.dtd"
   xmlns:inkscape="http://www.inkscape.org/namespaces/inkscape"
   width="188.69458mm"
   height="176.3414mm"
   viewBox="0 0 188.69458 176.3414"
   version="1.1"
   id="svg8"
   inkscape:version="1.0.1 (3bc2e813f5, 2020-09-07)"
   sodipodi:docname="pipeline-input-output-rebuilding.svg">
  <defs
     id="defs2">
    <marker
       inkscape:isstock="true"
       style="overflow:visible"
       id="marker4124"
       refX="0"
       refY="0"
       orient="auto"
       inkscape:stockid="EmptyTriangleOutL">
      <path
         transform="matrix(0.8,0,0,0.8,-4.8,0)"
         style="fill:#ffffff;fill-rule:evenodd;stroke:#000000;stroke-width:1.00000003pt;stroke-opacity:1"
         d="M 5.77,0 -2.88,5 V -5 Z"
         id="path4122"
         inkscape:connector-curvature="0" />
    </marker>
    <marker
       inkscape:stockid="EmptyTriangleOutL"
       orient="auto"
       refY="0"
       refX="0"
       id="EmptyTriangleOutL"
       style="overflow:visible"
       inkscape:isstock="true">
      <path
         id="path1785"
         d="M 5.77,0 -2.88,5 V -5 Z"
         style="fill:#ffffff;fill-rule:evenodd;stroke:#000000;stroke-width:1.00000003pt;stroke-opacity:1"
         transform="matrix(0.8,0,0,0.8,-4.8,0)"
         inkscape:connector-curvature="0" />
    </marker>
    <marker
       inkscape:stockid="Arrow2Lend"
       orient="auto"
       refY="0"
       refX="0"
       id="Arrow2Lend"
       style="overflow:visible"
       inkscape:isstock="true">
      <path
         id="path1646"
         style="fill:#000000;fill-opacity:1;fill-rule:evenodd;stroke:#000000;stroke-width:0.625;stroke-linejoin:round;stroke-opacity:1"
         d="M 8.7185878,4.0337352 -2.2072895,0.01601326 8.7185884,-4.0017078 c -1.7454984,2.3720609 -1.7354408,5.6174519 -6e-7,8.035443 z"
         transform="matrix(-1.1,0,0,-1.1,-1.1,0)"
         inkscape:connector-curvature="0" />
    </marker>
    <marker
       inkscape:stockid="EmptyTriangleOutL"
       orient="auto"
       refY="0"
       refX="0"
       id="EmptyTriangleOutL-9"
       style="overflow:visible"
       inkscape:isstock="true"
       inkscape:collect="always">
      <path
         inkscape:connector-curvature="0"
         id="path1785-8"
         d="M 5.77,0 -2.88,5 V -5 Z"
         style="fill:#ffffff;fill-rule:evenodd;stroke:#000000;stroke-width:1.00000003pt;stroke-opacity:1"
         transform="matrix(0.8,0,0,0.8,-4.8,0)" />
    </marker>
    <marker
       inkscape:stockid="EmptyTriangleOutL"
       orient="auto"
       refY="0"
       refX="0"
       id="EmptyTriangleOutL-9-4"
       style="overflow:visible"
       inkscape:isstock="true">
      <path
         inkscape:connector-curvature="0"
         id="path1785-8-4"
         d="M 5.77,0 -2.88,5 V -5 Z"
         style="fill:#ffffff;fill-rule:evenodd;stroke:#000000;stroke-width:1.00000003pt;stroke-opacity:1"
         transform="matrix(0.8,0,0,0.8,-4.8,0)" />
    </marker>
    <marker
       inkscape:stockid="EmptyTriangleOutL"
       orient="auto"
       refY="0"
       refX="0"
       id="EmptyTriangleOutL-9-7"
       style="overflow:visible"
       inkscape:isstock="true">
      <path
         inkscape:connector-curvature="0"
         id="path1785-8-6"
         d="M 5.77,0 -2.88,5 V -5 Z"
         style="fill:#ffffff;fill-rule:evenodd;stroke:#000000;stroke-width:1.00000003pt;stroke-opacity:1"
         transform="matrix(0.8,0,0,0.8,-4.8,0)" />
    </marker>
    <marker
       inkscape:stockid="EmptyTriangleOutL"
       orient="auto"
       refY="0"
       refX="0"
       id="EmptyTriangleOutL-9-1"
       style="overflow:visible"
       inkscape:isstock="true">
      <path
         inkscape:connector-curvature="0"
         id="path1785-8-7"
         d="M 5.77,0 -2.88,5 V -5 Z"
         style="fill:#ffffff;fill-rule:evenodd;stroke:#000000;stroke-width:1.00000003pt;stroke-opacity:1"
         transform="matrix(0.8,0,0,0.8,-4.8,0)" />
    </marker>
    <marker
       inkscape:stockid="EmptyTriangleOutL"
       orient="auto"
       refY="0"
       refX="0"
       id="EmptyTriangleOutL-9-9"
       style="overflow:visible"
       inkscape:isstock="true">
      <path
         inkscape:connector-curvature="0"
         id="path1785-8-62"
         d="M 5.77,0 -2.88,5 V -5 Z"
         style="fill:#ffffff;fill-rule:evenodd;stroke:#000000;stroke-width:1.00000003pt;stroke-opacity:1"
         transform="matrix(0.8,0,0,0.8,-4.8,0)" />
    </marker>
    <marker
       inkscape:isstock="true"
       style="overflow:visible"
       id="marker4124-5"
       refX="0"
       refY="0"
       orient="auto"
       inkscape:stockid="EmptyTriangleOutL">
      <path
         transform="matrix(0.8,0,0,0.8,-4.8,0)"
         style="fill:#ffffff;fill-rule:evenodd;stroke:#000000;stroke-width:1pt;stroke-opacity:1"
         d="M 5.77,0 -2.88,5 V -5 Z"
         id="path4122-5"
         inkscape:connector-curvature="0" />
    </marker>
  </defs>
  <sodipodi:namedview
     id="base"
     pagecolor="#ffffff"
     bordercolor="#666666"
     borderopacity="1.0"
     inkscape:pageopacity="0.0"
     inkscape:pageshadow="2"
     inkscape:zoom="1.6908484"
     inkscape:cx="596.04618"
     inkscape:cy="397.61745"
     inkscape:document-units="mm"
     inkscape:current-layer="g1493"
     showgrid="false"
     inkscape:window-width="1920"
     inkscape:window-height="1009"
     inkscape:window-x="0"
     inkscape:window-y="0"
     inkscape:window-maximized="1"
     inkscape:snap-midpoints="true"
     fit-margin-top="5"
     fit-margin-right="5"
     fit-margin-bottom="5"
     fit-margin-left="5"
     inkscape:snap-smooth-nodes="true"
     inkscape:snap-intersection-paths="true"
     inkscape:object-paths="true"
     inkscape:document-rotation="0"
     inkscape:snap-object-midpoints="false"
     inkscape:snap-bbox="true"
     inkscape:bbox-paths="true"
     inkscape:bbox-nodes="true"
     inkscape:snap-bbox-edge-midpoints="true" />
  <metadata
     id="metadata5">
    <rdf:RDF>
      <cc:Work
         rdf:about="">
        <dc:format>image/svg+xml</dc:format>
        <dc:type
           rdf:resource="http://purl.org/dc/dcmitype/StillImage" />
        <dc:title />
      </cc:Work>
    </rdf:RDF>
  </metadata>
  <g
     inkscape:label="Livello 1"
     inkscape:groupmode="layer"
     id="layer1"
     style="display:inline"
     transform="translate(-2.5900329,-7.0938072)">
    <g
       id="g1148">
      <g
         id="g1106">
        <rect
           style="display:inline;opacity:1;vector-effect:none;fill:#9ee7e8;fill-opacity:1;stroke:#000000;stroke-width:0.5;stroke-linecap:butt;stroke-linejoin:miter;stroke-miterlimit:4;stroke-dasharray:none;stroke-dashoffset:0;stroke-opacity:1"
           id="rect34-3"
           width="69.816628"
           height="31.092197"
           x="7.8400331"
           y="56.454395"
           rx="1.9861313"
           ry="1.759023" />
        <g
           id="g939"
           transform="translate(-2.003479e-7,15.345832)">
          <g
             id="g847">
            <text
               xml:space="preserve"
               style="font-style:normal;font-weight:normal;font-size:3.52777767px;line-height:1.25;font-family:sans-serif;letter-spacing:0px;word-spacing:0px;fill:#000000;fill-opacity:1;stroke:none;stroke-width:0.26458332"
               x="11.397229"
               y="57.927406"
               id="text12"><tspan
                 id="tspan1163"
                 sodipodi:role="line"
                 x="11.397229"
                 y="57.927406"
                 style="font-style:normal;font-variant:normal;font-weight:normal;font-stretch:normal;font-family:monospace;-inkscape-font-specification:monospace;stroke-width:0.26458332">34980ba ← v2020:latest</tspan><tspan
                 id="tspan1161"
                 sodipodi:role="line"
                 x="11.397229"
                 y="62.337128"
                 style="font-style:normal;font-variant:normal;font-weight:bold;font-stretch:normal;font-family:monospace;-inkscape-font-specification:monospace;stroke-width:0.26458332">c564448</tspan><tspan
                 id="tspan1159"
                 sodipodi:role="line"
                 x="11.397229"
                 y="66.746849"
                 style="font-style:normal;font-variant:normal;font-weight:normal;font-stretch:normal;font-family:monospace;-inkscape-font-specification:monospace;stroke-width:0.26458332">cf381b5</tspan><tspan
                 sodipodi:role="line"
                 x="11.397229"
                 y="71.15657"
                 id="tspan18"
                 style="font-style:normal;font-variant:normal;font-weight:normal;font-stretch:normal;font-family:monospace;-inkscape-font-specification:monospace;stroke-width:0.26458332" /></text>
            <text
               xml:space="preserve"
               style="font-style:normal;font-variant:normal;font-weight:bold;font-stretch:normal;font-size:3.52777767px;line-height:1.25;font-family:sans-serif;font-variant-ligatures:normal;font-variant-position:normal;font-variant-caps:normal;font-variant-numeric:normal;font-variant-alternates:normal;font-feature-settings:normal;text-indent:0;text-align:start;text-decoration:none;text-decoration-line:none;text-decoration-style:solid;text-decoration-color:#000000;letter-spacing:0px;word-spacing:0px;text-transform:none;writing-mode:lr-tb;direction:ltr;text-orientation:mixed;dominant-baseline:auto;baseline-shift:baseline;text-anchor:start;white-space:normal;shape-padding:0;opacity:1;vector-effect:none;fill:#000000;fill-opacity:1;stroke:none;stroke-width:0.26458332;stroke-linecap:butt;stroke-linejoin:miter;stroke-miterlimit:4;stroke-dasharray:none;stroke-dashoffset:0;stroke-opacity:1"
               x="11.397229"
               y="49.192802"
               id="text28"><tspan
                 sodipodi:role="line"
                 x="11.397229"
                 y="49.192802"
                 style="font-style:normal;font-variant:normal;font-weight:bold;font-stretch:normal;font-size:3.52777767px;line-height:1.25;font-family:sans-serif;font-variant-ligatures:normal;font-variant-position:normal;font-variant-caps:normal;font-variant-numeric:normal;font-variant-alternates:normal;font-feature-settings:normal;text-indent:0;text-align:start;text-decoration:none;text-decoration-line:none;text-decoration-style:solid;text-decoration-color:#000000;letter-spacing:0px;word-spacing:0px;text-transform:none;writing-mode:lr-tb;direction:ltr;text-orientation:mixed;dominant-baseline:auto;baseline-shift:baseline;text-anchor:start;white-space:normal;shape-padding:0;vector-effect:none;fill:#000000;fill-opacity:1;stroke:none;stroke-width:0.26458332;stroke-linecap:butt;stroke-linejoin:miter;stroke-miterlimit:4;stroke-dasharray:none;stroke-dashoffset:0;stroke-opacity:1"
                 id="tspan30">Docker images for the build env</tspan></text>
          </g>
        </g>
      </g>
      <g
         transform="translate(-87.830629,-23.447365)"
         id="g949">
        <rect
           style="display:inline;opacity:1;vector-effect:none;fill:#9ee7e8;fill-opacity:1;stroke:#000000;stroke-width:0.5;stroke-linecap:butt;stroke-linejoin:miter;stroke-miterlimit:4;stroke-dasharray:none;stroke-dashoffset:0;stroke-opacity:1"
           id="rect34-4"
           width="55.666122"
           height="31.092201"
           x="95.670662"
           y="43.517891"
           rx="1.9861313"
           ry="1.759023" />
        <g
           transform="translate(87.830626,2.4093271)"
           style="display:inline"
           id="g847-4">
          <text
             id="text12-3"
             y="57.927406"
             x="11.397229"
             style="font-style:normal;font-weight:normal;font-size:3.52777767px;line-height:1.25;font-family:sans-serif;letter-spacing:0px;word-spacing:0px;fill:#000000;fill-opacity:1;stroke:none;stroke-width:0.26458332"
             xml:space="preserve"><tspan
               style="font-style:normal;font-variant:normal;font-weight:normal;font-stretch:normal;font-family:monospace;-inkscape-font-specification:monospace;stroke-width:0.26458332"
               y="57.927406"
               x="11.397229"
               sodipodi:role="line"
               id="tspan1153">ba983f1 ← apertis/v2020</tspan><tspan
               style="font-style:normal;font-variant:normal;font-weight:normal;font-stretch:normal;font-family:monospace;-inkscape-font-specification:monospace;stroke-width:0.26458332"
               y="62.337128"
               x="11.397229"
               sodipodi:role="line"
               id="tspan887">283ba2c</tspan><tspan
               id="tspan18-8"
               style="font-style:normal;font-variant:normal;font-weight:bold;font-stretch:normal;font-family:monospace;-inkscape-font-specification:monospace;stroke-width:0.26458332"
               y="66.746849"
               x="11.397229"
               sodipodi:role="line">645e418</tspan></text>
          <text
             id="text28-6"
             y="49.192802"
             x="11.397229"
             style="font-style:normal;font-weight:normal;font-size:3.52777767px;line-height:1.25;font-family:sans-serif;letter-spacing:0px;word-spacing:0px;fill:#000000;fill-opacity:1;stroke:none;stroke-width:0.26458332"
             xml:space="preserve"><tspan
               id="tspan30-8"
               style="font-weight:bold;stroke-width:0.26458332"
               y="49.192802"
               x="11.397229"
               sodipodi:role="line">Image recipes</tspan></text>
        </g>
      </g>
      <g
         transform="translate(-8.2666375,-17.014433)"
         id="g959">
        <rect
           style="display:inline;opacity:1;vector-effect:none;fill:#9ee7e8;fill-opacity:1;stroke:#000000;stroke-width:0.5;stroke-linecap:butt;stroke-linejoin:miter;stroke-miterlimit:4;stroke-dasharray:none;stroke-dashoffset:0;stroke-opacity:1"
           id="rect34-8"
           width="58.122971"
           height="31.092194"
           x="16.10667"
           y="109.85271"
           rx="1.9861313"
           ry="1.759023" />
        <g
           transform="translate(8.266638,68.744149)"
           style="display:inline"
           id="g847-43">
          <text
             id="text12-1"
             y="57.927406"
             x="11.397229"
             style="font-style:normal;font-weight:normal;font-size:3.52777767px;line-height:1.25;font-family:sans-serif;letter-spacing:0px;word-spacing:0px;fill:#000000;fill-opacity:1;stroke:none;stroke-width:0.26458332"
             xml:space="preserve"><tspan
               id="tspan16-9"
               style="font-style:normal;font-variant:normal;font-weight:normal;font-stretch:normal;font-family:monospace;-inkscape-font-specification:monospace;stroke-width:0.26458332"
               y="57.927406"
               x="11.397229"
               sodipodi:role="line">20200412T122111Z ← v2020</tspan><tspan
               style="font-style:normal;font-variant:normal;font-weight:normal;font-stretch:normal;font-family:monospace;-inkscape-font-specification:monospace;stroke-width:0.26458332"
               y="62.337128"
               x="11.397229"
               sodipodi:role="line"
               id="tspan927">20200411T161545Z</tspan><tspan
               id="tspan18-2"
               style="font-style:normal;font-variant:normal;font-weight:bold;font-stretch:normal;font-family:monospace;-inkscape-font-specification:monospace;stroke-width:0.26458332"
               y="66.746849"
               x="11.397229"
               sodipodi:role="line">20200309T115300Z</tspan></text>
          <text
             id="text28-0"
             y="49.192802"
             x="11.397229"
             style="font-style:normal;font-weight:normal;font-size:3.52777767px;line-height:1.25;font-family:sans-serif;letter-spacing:0px;word-spacing:0px;fill:#000000;fill-opacity:1;stroke:none;stroke-width:0.26458332"
             xml:space="preserve"><tspan
               id="tspan30-6"
               style="font-weight:bold;stroke-width:0.26458332"
               y="49.192802"
               x="11.397229"
               sodipodi:role="line">APT repositories</tspan></text>
        </g>
      </g>
      <g
         transform="translate(-35.008455,28.062855)"
         id="g1019">
        <rect
           style="display:inline;opacity:1;vector-effect:none;fill:#9ee7e8;fill-opacity:1;stroke:#000000;stroke-width:0.5;stroke-linecap:butt;stroke-linejoin:miter;stroke-miterlimit:4;stroke-dasharray:none;stroke-dashoffset:0;stroke-opacity:1"
           id="rect34-4-9"
           width="55.666122"
           height="36.036686"
           x="42.848488"
           y="101.15926"
           rx="1.9861313"
           ry="1.759023" />
        <g
           transform="translate(35.008451,60.050692)"
           style="display:inline"
           id="g847-4-2">
          <text
             id="text12-3-6"
             y="63.219078"
             x="11.397229"
             style="font-style:normal;font-weight:normal;font-size:3.52777767px;line-height:1.25;font-family:sans-serif;letter-spacing:0px;word-spacing:0px;fill:#000000;fill-opacity:1;stroke:none;stroke-width:0.26458332"
             xml:space="preserve"><tspan
               id="tspan16-7-6"
               style="font-style:normal;font-variant:normal;font-weight:normal;font-stretch:normal;font-family:monospace;-inkscape-font-specification:monospace;stroke-width:0.26458332"
               y="63.219078"
               x="11.397229"
               sodipodi:role="line"><tspan
   style="font-weight:bold"
   id="tspan1032">b602ab1</tspan> ← apertis/v2020</tspan><tspan
               style="font-style:normal;font-variant:normal;font-weight:normal;font-stretch:normal;font-family:monospace;-inkscape-font-specification:monospace;stroke-width:0.26458332"
               y="67.628799"
               x="11.397229"
               sodipodi:role="line"
               id="tspan887-4">34920f9</tspan><tspan
               id="tspan18-8-9"
               style="font-style:normal;font-variant:normal;font-weight:normal;font-stretch:normal;font-family:monospace;-inkscape-font-specification:monospace;stroke-width:0.26458332"
               y="72.038521"
               x="11.397229"
               sodipodi:role="line">7c3842g</tspan></text>
          <text
             id="text28-6-5"
             y="49.192802"
             x="11.397229"
             style="font-style:normal;font-weight:normal;font-size:3.52777767px;line-height:1.25;font-family:sans-serif;letter-spacing:0px;word-spacing:0px;fill:#000000;fill-opacity:1;stroke:none;stroke-width:0.26458332"
             xml:space="preserve"><tspan
               id="tspan30-8-0"
               style="font-weight:bold;stroke-width:0.26458332"
               y="49.192802"
               x="11.397229"
               sodipodi:role="line">External resources</tspan><tspan
               style="font-weight:normal;stroke-width:0.26458332"
               y="53.602524"
               x="11.397229"
               sodipodi:role="line"
               id="tspan1008">via Git-LFS</tspan></text>
        </g>
      </g>
    </g>
    <flowRoot
       xml:space="preserve"
       id="flowRoot1349"
       style="font-style:normal;font-weight:normal;font-size:13.33333302px;line-height:1.25;font-family:sans-serif;letter-spacing:0px;word-spacing:0px;fill:#000000;fill-opacity:1;stroke:none"
       transform="scale(0.26458333)"><flowRegion
         id="flowRegion1351"><rect
           id="rect1353"
           width="291.78571"
           height="62.142857"
           x="459.64285"
           y="259.30539" /></flowRegion><flowPara
         id="flowPara1355" /></flowRoot>
    <g
       id="g1493"
       transform="translate(-45.298804,79.764385)">
      <rect
         style="display:inline;opacity:1;vector-effect:none;fill:#e9f5d6;fill-opacity:1;stroke:#000000;stroke-width:0.524828;stroke-linecap:butt;stroke-linejoin:miter;stroke-miterlimit:4;stroke-dasharray:none;stroke-dashoffset:0;stroke-opacity:1"
         id="rect34-4-8-4"
         width="68.175102"
         height="111.32658"
         x="163.16022"
         y="-67.740112"
         rx="1.9862423"
         ry="1.9379532" />
      <text
         xml:space="preserve"
         style="font-style:normal;font-weight:normal;font-size:3.52777px;line-height:1.25;font-family:sans-serif;letter-spacing:0px;word-spacing:0px;display:inline;fill:#000000;fill-opacity:1;stroke:none;stroke-width:0.264583"
         x="166.71931"
         y="-60.882385"
         id="text28-6-2-7"><tspan
           sodipodi:role="line"
           x="166.71931"
           y="-60.882385"
           style="font-weight:bold;stroke-width:0.264583"
           id="tspan1060-6">Build pipeline</tspan><tspan
           sodipodi:role="line"
           x="166.71931"
           y="-56.472672"
           style="font-weight:normal;stroke-width:0.264583"
           id="tspan5402-5">setting <tspan
   style="font-style:normal;font-variant:normal;font-weight:normal;font-stretch:normal;font-family:monospace;-inkscape-font-specification:monospace"
   id="tspan1597">BUILD_ENV_OVERRIDE</tspan></tspan></text>
      <g
         id="g1323-69"
         transform="translate(33.379123,-70.642544)"
         style="display:inline">
        <rect
           ry="1.759023"
           rx="1.9861313"
           y="54.592598"
           x="131.57837"
           height="9.7365417"
           width="64.486031"
           id="rect34-4-8-1-3"
           style="display:inline;opacity:1;vector-effect:none;fill:#cce89e;fill-opacity:1;stroke:#000000;stroke-width:0.5;stroke-linecap:butt;stroke-linejoin:miter;stroke-miterlimit:4;stroke-dasharray:none;stroke-dashoffset:0;stroke-opacity:1" />
        <text
           id="text28-6-2-5-7"
           y="60.560169"
           x="133.34019"
           style="font-style:normal;font-weight:normal;font-size:3.52778px;line-height:1.25;font-family:sans-serif;letter-spacing:0px;word-spacing:0px;display:inline;fill:#000000;fill-opacity:1;stroke:none;stroke-width:0.264583"
           xml:space="preserve"><tspan
             id="tspan1060-9-4"
             style="font-weight:bold;stroke-width:0.264583"
             y="60.560169"
             x="133.34019"
             sodipodi:role="line">Checkout recipes</tspan></text>
      </g>
      <g
         style="display:inline"
         id="g1323-6-5"
         transform="translate(33.379123,-54.767547)">
        <rect
           ry="1.759023"
           rx="1.9861313"
           y="54.592598"
           x="131.57837"
           height="9.7365417"
           width="64.486023"
           id="rect34-4-8-1-7-2"
           style="display:inline;opacity:1;vector-effect:none;fill:#cce89e;fill-opacity:1;stroke:#000000;stroke-width:0.5;stroke-linecap:butt;stroke-linejoin:miter;stroke-miterlimit:4;stroke-dasharray:none;stroke-dashoffset:0;stroke-opacity:1" />
        <text
           id="text28-6-2-5-3-5"
           y="60.560169"
           x="133.34019"
           style="font-style:normal;font-weight:normal;font-size:3.52778px;line-height:1.25;font-family:sans-serif;letter-spacing:0px;word-spacing:0px;display:inline;fill:#000000;fill-opacity:1;stroke:none;stroke-width:0.264583"
           xml:space="preserve"><tspan
             id="tspan1060-9-6-4"
             style="font-weight:bold;stroke-width:0.264583"
             y="60.560169"
             x="133.34019"
             sodipodi:role="line">Create build environment</tspan></text>
      </g>
      <g
         style="display:inline"
         id="g1323-6-3-7"
         transform="translate(33.379123,-38.36337)">
        <rect
           ry="1.759023"
           rx="1.9861313"
           y="54.592598"
           x="131.57837"
           height="9.7365417"
           width="64.486023"
           id="rect34-4-8-1-7-9-4"
           style="display:inline;opacity:1;vector-effect:none;fill:#cce89e;fill-opacity:1;stroke:#000000;stroke-width:0.5;stroke-linecap:butt;stroke-linejoin:miter;stroke-miterlimit:4;stroke-dasharray:none;stroke-dashoffset:0;stroke-opacity:1" />
        <text
           id="text28-6-2-5-3-4-4"
           y="60.560169"
           x="133.34019"
           style="font-style:normal;font-weight:normal;font-size:3.52778px;line-height:1.25;font-family:sans-serif;letter-spacing:0px;word-spacing:0px;display:inline;fill:#000000;fill-opacity:1;stroke:none;stroke-width:0.264583"
           xml:space="preserve"><tspan
             id="tspan1060-9-6-8-3"
             style="font-weight:bold;stroke-width:0.264583"
             y="60.560169"
             x="133.34019"
             sodipodi:role="line">Populate rootfs</tspan></text>
      </g>
      <g
         style="display:inline"
         id="g1323-6-9-0"
         transform="translate(33.379123,-22.488377)">
        <rect
           ry="1.759023"
           rx="1.9861313"
           y="54.592598"
           x="131.57837"
           height="9.7365417"
           width="64.486023"
           id="rect34-4-8-1-7-3-7"
           style="display:inline;opacity:1;vector-effect:none;fill:#cce89e;fill-opacity:1;stroke:#000000;stroke-width:0.5;stroke-linecap:butt;stroke-linejoin:miter;stroke-miterlimit:4;stroke-dasharray:none;stroke-dashoffset:0;stroke-opacity:1" />
        <text
           id="text28-6-2-5-3-9-8"
           y="60.560169"
           x="133.34019"
           style="font-style:normal;font-weight:normal;font-size:3.52778px;line-height:1.25;font-family:sans-serif;letter-spacing:0px;word-spacing:0px;display:inline;fill:#000000;fill-opacity:1;stroke:none;stroke-width:0.264583"
           xml:space="preserve"><tspan
             id="tspan1060-9-6-0-68"
             style="font-weight:bold;stroke-width:0.264583"
             y="60.560169"
             x="133.34019"
             sodipodi:role="line">Add extra data<tspan
   style="font-weight:normal;font-size:2.99861px"
   id="tspan1030"> (e.g. demo music)</tspan></tspan></text>
      </g>
      <text
         xml:space="preserve"
         style="font-style:normal;font-weight:normal;font-size:3.52777px;line-height:1.25;font-family:sans-serif;letter-spacing:0px;word-spacing:0px;display:inline;fill:#000000;fill-opacity:1;stroke:none;stroke-width:0.264583"
         x="196.18669"
         y="-2.2959149"
         id="text12-3-1-9-4-5-3"><tspan
           sodipodi:role="line"
           x="196.18669"
           y="-2.2959149"
           style="font-style:normal;font-variant:normal;font-weight:normal;font-stretch:normal;font-family:monospace;-inkscape-font-specification:monospace;stroke-width:0.264583"
           id="tspan18-8-7-9-6-1">↓</tspan></text>
      <text
         xml:space="preserve"
         style="font-style:normal;font-weight:normal;font-size:3.52777px;line-height:1.25;font-family:sans-serif;letter-spacing:0px;word-spacing:0px;display:inline;fill:#000000;fill-opacity:1;stroke:none;stroke-width:0.264583"
         x="196.18669"
         y="14.108274"
         id="text12-3-1-9-4-5-1-4"><tspan
           sodipodi:role="line"
           x="196.18669"
           y="14.108274"
           style="font-style:normal;font-variant:normal;font-weight:normal;font-stretch:normal;font-family:monospace;-inkscape-font-specification:monospace;stroke-width:0.264583"
           id="tspan18-8-7-9-6-2-9">↓</tspan></text>
      <text
         xml:space="preserve"
         style="font-style:normal;font-weight:normal;font-size:3.52777px;line-height:1.25;font-family:sans-serif;letter-spacing:0px;word-spacing:0px;display:inline;fill:#000000;fill-opacity:1;stroke:none;stroke-width:0.264583"
         x="196.18669"
         y="29.983261"
         id="text12-3-1-9-4-5-8-2"><tspan
           sodipodi:role="line"
           x="196.18669"
           y="29.983261"
           style="font-style:normal;font-variant:normal;font-weight:normal;font-stretch:normal;font-family:monospace;-inkscape-font-specification:monospace;stroke-width:0.264583"
           id="tspan18-8-7-9-6-8-0">↓</tspan></text>
      <rect
         ry="1.759023"
         rx="1.9861313"
         y="55.38755"
         x="164.95749"
         height="42.715649"
         width="64.486023"
         id="rect34-4-8-1-7-3-0-6"
         style="display:inline;vector-effect:none;fill:#ecb146;fill-opacity:1;stroke:#000000;stroke-width:0.499999;stroke-linecap:butt;stroke-linejoin:miter;stroke-miterlimit:4;stroke-dasharray:none;stroke-dashoffset:0;stroke-opacity:1" />
      <text
         id="text28-6-2-5-3-9-9-8"
         y="61.355156"
         x="166.71931"
         style="font-style:normal;font-weight:normal;font-size:3.52777px;line-height:1.25;font-family:sans-serif;letter-spacing:0px;word-spacing:0px;display:inline;fill:#000000;fill-opacity:1;stroke:none;stroke-width:0.264583"
         xml:space="preserve"><tspan
           id="tspan1060-9-6-0-6-9"
           style="font-weight:bold;stroke-width:0.264583"
           y="61.355156"
           x="166.71931"
           sodipodi:role="line">Output</tspan></text>
      <text
         id="text1080-1-2"
         y="70.089714"
         x="166.71931"
         style="font-style:normal;font-weight:normal;font-size:3.52777px;line-height:1.25;font-family:sans-serif;letter-spacing:0px;word-spacing:0px;display:inline;fill:#000000;fill-opacity:1;stroke:none;stroke-width:0.264583"
         xml:space="preserve"><tspan
           style="stroke-width:0.264583"
           y="70.089714"
           x="166.71931"
           id="tspan1078-5-6"
           sodipodi:role="line">Artifacts: ospacks, images...</tspan><tspan
           id="tspan1496-6"
           y="74.499428"
           x="166.71931"
           sodipodi:role="line"
           style="stroke-width:0.264583" /><tspan
           id="tspan1502-4"
           style="font-style:normal;font-variant:normal;font-weight:normal;font-stretch:normal;font-family:sans-serif;-inkscape-font-specification:monospace;stroke-width:0.264583"
           y="78.909142"
           x="166.71931"
           sodipodi:role="line">Metadata:</tspan><tspan
           style="font-style:normal;font-variant:normal;font-weight:normal;font-stretch:normal;font-family:monospace;-inkscape-font-specification:monospace;stroke-width:0.264583"
           y="83.318855"
           x="166.71931"
           sodipodi:role="line"
           id="tspan5472-9">meta/build-env.txt</tspan><tspan
           id="tspan1529-5"
           style="font-style:normal;font-variant:normal;font-weight:normal;font-stretch:normal;font-family:monospace;-inkscape-font-specification:monospace;stroke-width:0.264583"
           y="87.728561"
           x="166.71931"
           sodipodi:role="line">*/*.pkglist.gz</tspan><tspan
           id="tspan1531-0"
           style="font-style:normal;font-variant:normal;font-weight:normal;font-stretch:normal;font-family:monospace;-inkscape-font-specification:monospace;stroke-width:0.264583"
           y="92.138275"
           x="166.71931"
           sodipodi:role="line">*/*.filelist.gz</tspan></text>
      <path
         style="display:inline;opacity:1;vector-effect:none;fill:none;fill-opacity:1;stroke:#000000;stroke-width:0.499999;stroke-linecap:butt;stroke-linejoin:miter;stroke-miterlimit:4;stroke-dasharray:none;stroke-dashoffset:0;stroke-opacity:1;marker-end:url(#marker4124-5)"
         d="m 197.20051,43.848881 v 11.30827"
         id="path4052-4"
         inkscape:connector-curvature="0"
         sodipodi:nodetypes="cc" />
      <g
         id="g1323-62"
         transform="translate(33.379123,-85.988377)"
         style="display:inline">
        <rect
           ry="1.759023"
           rx="1.9861313"
           y="33.425926"
           x="131.57837"
           height="30.903212"
           width="64.486023"
           id="rect34-4-8-1-6"
           style="display:inline;opacity:1;vector-effect:none;fill:#cce89e;fill-opacity:1;stroke:#000000;stroke-width:0.5;stroke-linecap:butt;stroke-linejoin:miter;stroke-miterlimit:4;stroke-dasharray:none;stroke-dashoffset:0;stroke-opacity:1" />
      </g>
      <text
         id="text28-6-2-5-36"
         y="-46.594875"
         x="166.71933"
         style="font-style:normal;font-weight:normal;font-size:3.52777px;line-height:1.25;font-family:sans-serif;letter-spacing:0px;word-spacing:0px;display:inline;fill:#000000;fill-opacity:1;stroke:none;stroke-width:0.264583"
         xml:space="preserve"><tspan
           id="tspan1060-9-0"
           style="font-weight:bold;stroke-width:0.264583"
           y="-46.594875"
           x="166.71933"
           sodipodi:role="line">Override build-env metadata</tspan></text>
      <text
         xml:space="preserve"
         style="font-style:normal;font-weight:normal;font-size:3.52777px;line-height:1.25;font-family:sans-serif;letter-spacing:0px;word-spacing:0px;display:inline;fill:#000000;fill-opacity:1;stroke:none;stroke-width:0.264583"
         x="166.71931"
         y="-38.918621"
         id="text1080-8"><tspan
           sodipodi:role="line"
           x="166.71931"
           y="-38.918621"
           style="font-style:normal;font-variant:normal;font-weight:normal;font-stretch:normal;font-family:monospace;-inkscape-font-specification:monospace;stroke-width:0.264583"
           id="tspan5338">RECIPE_COMMIT=<tspan
   style="font-weight:bold;stroke-width:0.264583"
   id="tspan1039">645e418</tspan></tspan><tspan
           sodipodi:role="line"
           x="166.71931"
           y="-34.508907"
           style="font-style:normal;font-variant:normal;font-weight:normal;font-stretch:normal;font-family:monospace;-inkscape-font-specification:monospace;stroke-width:0.264583"
           id="tspan5344-7">DOCKER_IMAGE=<tspan
   style="font-weight:bold;stroke-width:0.264583"
   id="tspan1028">…@sha256:c564448</tspan></tspan><tspan
           sodipodi:role="line"
           x="166.71931"
           y="-30.099195"
           style="font-style:normal;font-variant:normal;font-weight:normal;font-stretch:normal;font-family:monospace;-inkscape-font-specification:monospace;stroke-width:0.264583"
           id="tspan1025">APT_SNAPSHOT=<tspan
   style="font-weight:bold;stroke-width:0.264583"
   id="tspan1302">20200309T115300Z</tspan></tspan><tspan
           sodipodi:role="line"
           x="166.71931"
           y="-25.689484"
           style="font-style:normal;font-variant:normal;font-weight:normal;font-stretch:normal;font-family:monospace;-inkscape-font-specification:monospace;stroke-width:0.264583"
           id="tspan1110-1">MEDIA_REF=<tspan
   style="font-weight:bold;stroke-width:0.264583"
   id="tspan1304">b602ab1</tspan></tspan></text>
      <text
         xml:space="preserve"
         style="font-style:normal;font-weight:normal;font-size:3.52777px;line-height:1.25;font-family:sans-serif;letter-spacing:0px;word-spacing:0px;display:inline;fill:#000000;fill-opacity:1;stroke:none;stroke-width:0.264583"
         x="196.18669"
         y="-18.17091"
         id="text12-3-1-9-4-5-7"><tspan
           sodipodi:role="line"
           x="196.18669"
           y="-18.17091"
           style="font-style:normal;font-variant:normal;font-weight:normal;font-stretch:normal;font-family:monospace;-inkscape-font-specification:monospace;stroke-width:0.264583"
           id="tspan18-8-7-9-6-9">↓</tspan></text>
    </g>
    <path
       style="display:inline;fill:none;stroke:#000000;stroke-width:0.5;stroke-linecap:butt;stroke-linejoin:miter;stroke-miterlimit:4;stroke-dasharray:none;stroke-opacity:1;marker-end:url(#EmptyTriangleOutL-9)"
       d="M 28.020834,44.570978 119.5635,68.956886"
       id="path1623-4"
       inkscape:connector-curvature="0"
       sodipodi:nodetypes="cc" />
    <path
       style="display:inline;fill:none;stroke:#000000;stroke-width:0.5;stroke-linecap:butt;stroke-linejoin:miter;stroke-miterlimit:4;stroke-dasharray:none;stroke-opacity:1;marker-end:url(#EmptyTriangleOutL-9-4)"
       d="M 28.495277,76.001347 119.5635,84.703636"
       id="path1623-4-4"
       inkscape:connector-curvature="0"
       sodipodi:nodetypes="cc" />
    <path
       style="display:inline;fill:none;stroke:#000000;stroke-width:0.5;stroke-linecap:butt;stroke-linejoin:miter;stroke-miterlimit:4;stroke-dasharray:none;stroke-opacity:1;marker-end:url(#EmptyTriangleOutL-9-7)"
       d="M 47.204468,117.27264 119.5635,100.90735"
       id="path1623-4-3"
       inkscape:connector-curvature="0"
       sodipodi:nodetypes="cc" />
    <path
       style="display:inline;fill:none;stroke:#000000;stroke-width:0.5;stroke-linecap:butt;stroke-linejoin:miter;stroke-miterlimit:4;stroke-dasharray:none;stroke-opacity:1;marker-end:url(#EmptyTriangleOutL-9-1)"
       d="M 29.145984,148.68856 119.5635,116.84917"
       id="path1623-4-5"
       inkscape:connector-curvature="0"
       sodipodi:nodetypes="cc" />
    <text
       id="text12-3-7"
       y="48.031929"
       x="201.82059"
       style="font-style:normal;font-weight:normal;font-size:3.52777767px;line-height:1.25;font-family:sans-serif;letter-spacing:0px;word-spacing:0px;display:inline;fill:#000000;fill-opacity:1;stroke:none;stroke-width:0.26458332"
       xml:space="preserve"><tspan
         y="51.153187"
         x="201.82059"
         sodipodi:role="line"
         id="tspan5266"
         style="font-style:normal;font-variant:normal;font-weight:normal;font-stretch:normal;font-family:monospace;-inkscape-font-specification:monospace;stroke-width:0.26458332" /></text>
    <text
       xml:space="preserve"
       style="font-style:normal;font-weight:normal;font-size:3.52777767px;line-height:1.25;font-family:sans-serif;letter-spacing:0px;word-spacing:0px;fill:#000000;fill-opacity:1;stroke:none;stroke-width:0.26458332"
       x="217.5253"
       y="53.016369"
       id="text5244"><tspan
         sodipodi:role="line"
         id="tspan5242"
         x="217.5253"
         y="56.137627"
         style="stroke-width:0.26458332" /></text>
    <flowRoot
       xml:space="preserve"
       id="flowRoot5268"
       style="font-style:normal;font-weight:normal;font-size:13.33333302px;line-height:1.25;font-family:sans-serif;letter-spacing:0px;word-spacing:0px;fill:#000000;fill-opacity:1;stroke:none"
       transform="matrix(0.26458333,0,0,0.26458333,-12.189732,-43.561756)"><flowRegion
         id="flowRegion5270"><rect
           id="rect5272"
           width="210.71432"
           height="76.785706"
           x="799.28571"
           y="302.16254" /></flowRegion><flowPara
         id="flowPara5296" /></flowRoot>
    <text
       xml:space="preserve"
       style="font-style:normal;font-weight:normal;font-size:3.52777767px;line-height:1.25;font-family:sans-serif;letter-spacing:0px;word-spacing:0px;fill:#000000;fill-opacity:1;stroke:none;stroke-width:0.26458332"
       x="241.94344"
       y="61.348896"
       id="text1118"><tspan
         sodipodi:role="line"
         id="tspan1116"
         x="241.94344"
         y="64.470154"
         style="stroke-width:0.26458332" /></text>
  </g>
</svg>
