<?xml version="1.0" encoding="UTF-8" standalone="no"?>
<!DOCTYPE svg PUBLIC "-//W3C//DTD SVG 1.0//EN" "http://www.w3.org/TR/2001/PR-SVG-20010719/DTD/svg10.dtd">
<svg width="47cm" height="55cm" viewBox="39 -501 922 1082" xmlns="http://www.w3.org/2000/svg" xmlns:xlink="http://www.w3.org/1999/xlink">
  <g>
    <g>
      <rect style="fill: #ffc0cb" x="80" y="-420" width="300" height="220"/>
      <rect style="fill: none; fill-opacity:0; stroke-width: 2; stroke: #000000" x="80" y="-420" width="300" height="220"/>
    </g>
    <line style="fill: none; fill-opacity:0; stroke-width: 2; stroke: #000000" x1="80" y1="-400" x2="380" y2="-400"/>
    <line style="fill: none; fill-opacity:0; stroke-width: 2; stroke: #000000" x1="360" y1="-400" x2="360" y2="-420"/>
    <line style="fill: none; fill-opacity:0; stroke-width: 2; stroke: #000000" x1="340" y1="-400" x2="340" y2="-420"/>
    <line style="fill: none; fill-opacity:0; stroke-width: 2; stroke: #000000" x1="320" y1="-400" x2="320" y2="-420"/>
  </g>
  <g>
    <g>
      <rect style="fill: #e6e6fa" x="40" y="-380" width="300" height="220"/>
      <rect style="fill: none; fill-opacity:0; stroke-width: 2; stroke: #000000" x="40" y="-380" width="300" height="220"/>
    </g>
    <line style="fill: none; fill-opacity:0; stroke-width: 2; stroke: #000000" x1="40" y1="-360" x2="340" y2="-360"/>
    <line style="fill: none; fill-opacity:0; stroke-width: 2; stroke: #000000" x1="320" y1="-360" x2="320" y2="-380"/>
    <line style="fill: none; fill-opacity:0; stroke-width: 2; stroke: #000000" x1="300" y1="-360" x2="300" y2="-380"/>
    <line style="fill: none; fill-opacity:0; stroke-width: 2; stroke: #000000" x1="280" y1="-360" x2="280" y2="-380"/>
  </g>
  <text font-size="56.4444" style="fill: #000000;text-anchor:middle;font-family:sans-serif;font-style:normal;font-weight:normal" x="190" y="-250.45">
    <tspan x="190" y="-250.45">2</tspan>
  </text>
  <g>
    <g>
      <rect style="fill: #ffff84" x="80" y="-50" width="300" height="220"/>
      <rect style="fill: none; fill-opacity:0; stroke-width: 2; stroke: #000000" x="80" y="-50" width="300" height="220"/>
    </g>
    <line style="fill: none; fill-opacity:0; stroke-width: 2; stroke: #000000" x1="80" y1="-30" x2="380" y2="-30"/>
    <line style="fill: none; fill-opacity:0; stroke-width: 2; stroke: #000000" x1="360" y1="-30" x2="360" y2="-50"/>
    <line style="fill: none; fill-opacity:0; stroke-width: 2; stroke: #000000" x1="340" y1="-30" x2="340" y2="-50"/>
    <line style="fill: none; fill-opacity:0; stroke-width: 2; stroke: #000000" x1="320" y1="-30" x2="320" y2="-50"/>
  </g>
  <text font-size="56.4444" style="fill: #000000;text-anchor:middle;font-family:sans-serif;font-style:normal;font-weight:normal" x="230" y="79.55">
    <tspan x="230" y="79.55">1</tspan>
  </text>
  <g>
    <rect style="fill: #e17de5" x="280" y="370" width="100" height="100"/>
    <rect style="fill: none; fill-opacity:0; stroke-width: 2; stroke: #000000" x="280" y="370" width="100" height="100"/>
  </g>
  <text font-size="12.8" style="fill: #000000;text-anchor:middle;font-family:sans-serif;font-style:normal;font-weight:normal" x="330" y="424.45">
    <tspan x="330" y="424.45">Video</tspan>
  </text>
  <g>
    <rect style="fill: #ffffff" x="500" y="-100" width="460" height="320"/>
    <rect style="fill: none; fill-opacity:0; stroke-width: 2; stroke: #000000" x="500" y="-100" width="460" height="320"/>
  </g>
  <g>
    <rect style="fill: #ffffff" x="500" y="260" width="460" height="320"/>
    <rect style="fill: none; fill-opacity:0; stroke-width: 2; stroke: #000000" x="500" y="260" width="460" height="320"/>
  </g>
  <g>
    <rect style="fill: #ffffff" x="500" y="-460" width="460" height="320"/>
    <rect style="fill: none; fill-opacity:0; stroke-width: 2; stroke: #000000" x="500" y="-460" width="460" height="320"/>
  </g>
  <g>
    <line style="fill: none; fill-opacity:0; stroke-width: 2; stroke: #000000" x1="380" y1="-300" x2="490.264" y2="-300"/>
    <polygon style="fill: #000000" points="497.764,-300 487.764,-295 490.264,-300 487.764,-305 "/>
    <polygon style="fill: none; fill-opacity:0; stroke-width: 2; stroke: #000000" points="497.764,-300 487.764,-295 490.264,-300 487.764,-305 "/>
  </g>
  <g>
    <line style="fill: none; fill-opacity:0; stroke-width: 2; stroke: #000000" x1="380" y1="60" x2="490.264" y2="60"/>
    <polygon style="fill: #000000" points="497.764,60 487.764,65 490.264,60 487.764,55 "/>
    <polygon style="fill: none; fill-opacity:0; stroke-width: 2; stroke: #000000" points="497.764,60 487.764,65 490.264,60 487.764,55 "/>
  </g>
  <g>
    <line style="fill: none; fill-opacity:0; stroke-width: 2; stroke: #000000" x1="380" y1="420" x2="490.264" y2="420"/>
    <polygon style="fill: #000000" points="497.764,420 487.764,425 490.264,420 487.764,415 "/>
    <polygon style="fill: none; fill-opacity:0; stroke-width: 2; stroke: #000000" points="497.764,420 487.764,425 490.264,420 487.764,415 "/>
  </g>
  <text font-size="22.5778" style="fill: #000000;text-anchor:middle;font-family:sans-serif;font-style:normal;font-weight:normal" x="730" y="-480">
    <tspan x="730" y="-480">Composited overlays</tspan>
  </text>
  <g>
    <g>
      <rect style="fill: #ffc0cb" x="640" y="-440" width="300" height="220"/>
      <rect style="fill: none; fill-opacity:0; stroke-width: 2; stroke: #000000" x="640" y="-440" width="300" height="220"/>
    </g>
    <line style="fill: none; fill-opacity:0; stroke-width: 2; stroke: #000000" x1="640" y1="-420" x2="940" y2="-420"/>
    <line style="fill: none; fill-opacity:0; stroke-width: 2; stroke: #000000" x1="920" y1="-420" x2="920" y2="-440"/>
    <line style="fill: none; fill-opacity:0; stroke-width: 2; stroke: #000000" x1="900" y1="-420" x2="900" y2="-440"/>
    <line style="fill: none; fill-opacity:0; stroke-width: 2; stroke: #000000" x1="880" y1="-420" x2="880" y2="-440"/>
  </g>
  <g>
    <g>
      <rect style="fill: #e6e6fa" x="600" y="-400" width="300" height="220"/>
      <rect style="fill: none; fill-opacity:0; stroke-width: 2; stroke: #000000" x="600" y="-400" width="300" height="220"/>
    </g>
    <line style="fill: none; fill-opacity:0; stroke-width: 2; stroke: #000000" x1="600" y1="-380" x2="900" y2="-380"/>
    <line style="fill: none; fill-opacity:0; stroke-width: 2; stroke: #000000" x1="880" y1="-380" x2="880" y2="-400"/>
    <line style="fill: none; fill-opacity:0; stroke-width: 2; stroke: #000000" x1="860" y1="-380" x2="860" y2="-400"/>
    <line style="fill: none; fill-opacity:0; stroke-width: 2; stroke: #000000" x1="840" y1="-380" x2="840" y2="-400"/>
  </g>
  <text font-size="56.4444" style="fill: #000000;text-anchor:middle;font-family:sans-serif;font-style:normal;font-weight:normal" x="750" y="-270.45">
    <tspan x="750" y="-270.45">2</tspan>
  </text>
  <g>
    <g>
      <rect style="fill: #ffff84" x="520" y="-70" width="300" height="220"/>
      <rect style="fill: none; fill-opacity:0; stroke-width: 2; stroke: #000000" x="520" y="-70" width="300" height="220"/>
    </g>
    <line style="fill: none; fill-opacity:0; stroke-width: 2; stroke: #000000" x1="520" y1="-50" x2="820" y2="-50"/>
    <line style="fill: none; fill-opacity:0; stroke-width: 2; stroke: #000000" x1="800" y1="-50" x2="800" y2="-70"/>
    <line style="fill: none; fill-opacity:0; stroke-width: 2; stroke: #000000" x1="780" y1="-50" x2="780" y2="-70"/>
    <line style="fill: none; fill-opacity:0; stroke-width: 2; stroke: #000000" x1="760" y1="-50" x2="760" y2="-70"/>
  </g>
  <text font-size="56.4444" style="fill: #000000;text-anchor:middle;font-family:sans-serif;font-style:normal;font-weight:normal" x="670" y="59.55">
    <tspan x="670" y="59.55">1</tspan>
  </text>
  <g>
    <rect style="fill: #e17de5" x="700" y="350" width="100" height="100"/>
    <rect style="fill: none; fill-opacity:0; stroke-width: 2; stroke: #000000" x="700" y="350" width="100" height="100"/>
  </g>
  <text font-size="12.8" style="fill: #000000;text-anchor:middle;font-family:sans-serif;font-style:normal;font-weight:normal" x="750" y="404.45">
    <tspan x="750" y="404.45">Video</tspan>
  </text>
  <text font-size="12.8" style="fill: #000000;text-anchor:middle;font-family:sans-serif;font-style:normal;font-weight:normal" x="440" y="-339">
    <tspan x="440" y="-339">Composited</tspan>
    <tspan x="440" y="-323">in GPU</tspan>
  </text>
  <text font-size="12.8" style="fill: #000000;text-anchor:start;font-family:sans-serif;font-style:normal;font-weight:normal" x="420" y="-520">
    <tspan x="420" y="-520"></tspan>
  </text>
</svg>
