<?xml version="1.0" encoding="UTF-8" standalone="no"?>
<!-- Created with Inkscape (http://www.inkscape.org/) -->

<svg
   xmlns:dc="http://purl.org/dc/elements/1.1/"
   xmlns:cc="http://creativecommons.org/ns#"
   xmlns:rdf="http://www.w3.org/1999/02/22-rdf-syntax-ns#"
   xmlns:svg="http://www.w3.org/2000/svg"
   xmlns="http://www.w3.org/2000/svg"
   xmlns:sodipodi="http://sodipodi.sourceforge.net/DTD/sodipodi-0.dtd"
   xmlns:inkscape="http://www.inkscape.org/namespaces/inkscape"
   width="570"
   height="570.00006"
   viewBox="0 0 570.00002 570.00007"
   id="svg2"
   version="1.1"
   inkscape:version="0.91 r13725"
   sodipodi:docname="apertis-applications-venn.svg">
  <defs
     id="defs4">
    <inkscape:perspective
       sodipodi:type="inkscape:persp3d"
       inkscape:vp_x="0 : 310.43311 : 1"
       inkscape:vp_y="0 : 1000 : 0"
       inkscape:vp_z="620.86617 : 310.43311 : 1"
       inkscape:persp3d-origin="310.43309 : 206.95541 : 1"
       id="perspective4201" />
  </defs>
  <sodipodi:namedview
     id="base"
     pagecolor="#ffffff"
     bordercolor="#666666"
     borderopacity="1.0"
     inkscape:pageopacity="0.0"
     inkscape:pageshadow="2"
     inkscape:zoom="1"
     inkscape:cx="94.323264"
     inkscape:cy="247.09398"
     inkscape:document-units="px"
     inkscape:current-layer="layer1"
     showgrid="true"
     units="px"
     inkscape:window-width="1920"
     inkscape:window-height="1014"
     inkscape:window-x="0"
     inkscape:window-y="27"
     inkscape:window-maximized="1"
     fit-margin-top="10"
     fit-margin-left="10"
     fit-margin-right="10"
     fit-margin-bottom="10">
    <inkscape:grid
       type="xygrid"
       id="grid3336"
       originx="4.7474576e-07"
       originy="1.7693844e-05" />
  </sodipodi:namedview>
  <metadata
     id="metadata7">
    <rdf:RDF>
      <cc:Work
         rdf:about="">
        <dc:format>image/svg+xml</dc:format>
        <dc:type
           rdf:resource="http://purl.org/dc/dcmitype/StillImage" />
        <dc:title></dc:title>
      </cc:Work>
    </rdf:RDF>
  </metadata>
  <g
     inkscape:label="Layer 1"
     inkscape:groupmode="layer"
     id="layer1"
     transform="translate(2.9802323e-7,-482.36215)">
    <rect
       ry="19.461884"
       rx="19.461884"
       style="fill:#3465a4;fill-opacity:0.49717515;stroke:#2e3436;stroke-width:1.07630217"
       id="rect3506"
       width="548.92371"
       height="418.92368"
       x="10.538151"
       y="492.9003" />
    <rect
       y="502.86575"
       x="40.503628"
       height="298.99274"
       width="508.99274"
       id="rect3340"
       style="fill:#4e9a06;fill-opacity:0.49717515;stroke:#2e3436;stroke-width:1.00725746"
       rx="19.496429"
       ry="19.496429" />
    <rect
       style="fill:#ad7fa8;fill-opacity:0.49717515;stroke:#2e3436;stroke-width:1.10490465"
       id="rect3338"
       width="508.89508"
       height="239.8951"
       x="40.552452"
       y="801.91467"
       rx="19.458281"
       ry="20.303556" />
    <text
       xml:space="preserve"
       style="font-style:normal;font-variant:normal;font-weight:bold;font-stretch:normal;font-size:15px;line-height:125%;font-family:Karla;-inkscape-font-specification:'Karla, Bold';text-align:start;letter-spacing:0px;word-spacing:0px;writing-mode:lr-tb;text-anchor:start;fill:#000000;fill-opacity:1;stroke:none;stroke-width:1px;stroke-linecap:butt;stroke-linejoin:miter;stroke-opacity:1"
       x="51"
       y="530.36218"
       id="text3342"
       sodipodi:linespacing="125%"><tspan
         sodipodi:role="line"
         id="tspan3344"
         x="51"
         y="530.36218">Store application bundles</tspan></text>
    <rect
       ry="19.776728"
       rx="20.417339"
       y="702.86456"
       x="50.502361"
       height="88.995277"
       width="488.99527"
       id="rect3350"
       style="fill:#4e9a06;fill-opacity:0.49717515;stroke:#2e3436;stroke-width:1.00472403" />
    <text
       sodipodi:linespacing="125%"
       id="text3352"
       y="723.36218"
       x="61"
       style="font-style:normal;font-variant:normal;font-weight:bold;font-stretch:normal;font-size:15px;line-height:125%;font-family:Karla;-inkscape-font-specification:'Karla, Bold';text-align:start;letter-spacing:0px;word-spacing:0px;writing-mode:lr-tb;text-anchor:start;fill:#000000;fill-opacity:1;stroke:none;stroke-width:1px;stroke-linecap:butt;stroke-linejoin:miter;stroke-opacity:1"
       xml:space="preserve"><tspan
         y="723.36218"
         x="61"
         id="tspan3354"
         sodipodi:role="line">Preinstalled application bundles</tspan></text>
    <rect
       style="fill:#4e9a06;stroke:#2e3436;stroke-width:0.41479295"
       id="rect3356"
       width="149.58521"
       height="49.585209"
       x="60.207397"
       y="732.56958"
       rx="19.792603"
       ry="19.792603" />
    <text
       sodipodi:linespacing="125%"
       id="text3358"
       y="767.36218"
       x="71"
       style="font-style:normal;font-variant:normal;font-weight:normal;font-stretch:normal;font-size:30px;line-height:125%;font-family:Karla;-inkscape-font-specification:'Karla, Normal';text-align:start;letter-spacing:0px;word-spacing:0px;writing-mode:lr-tb;text-anchor:start;fill:#000000;fill-opacity:1;stroke:none;stroke-width:1px;stroke-linecap:butt;stroke-linejoin:miter;stroke-opacity:1"
       xml:space="preserve"><tspan
         y="767.36218"
         x="71"
         id="tspan3360"
         sodipodi:role="line">Weather</tspan></text>
    <rect
       ry="19.792603"
       rx="19.792603"
       y="732.56958"
       x="220.2074"
       height="49.585209"
       width="149.58521"
       id="rect3362"
       style="fill:#4e9a06;stroke:#2e3436;stroke-width:0.41479295" />
    <rect
       style="fill:#4e9a06;stroke:#2e3436;stroke-width:0.41479295"
       id="rect3368"
       width="149.58521"
       height="49.585209"
       x="380.2074"
       y="732.56958"
       rx="19.792603"
       ry="19.792603" />
    <text
       sodipodi:linespacing="125%"
       id="text3370"
       y="764.36218"
       x="391"
       style="font-style:normal;font-variant:normal;font-weight:normal;font-stretch:normal;font-size:25px;line-height:125%;font-family:Karla;-inkscape-font-specification:'Karla, Normal';text-align:start;letter-spacing:0px;word-spacing:0px;writing-mode:lr-tb;text-anchor:start;fill:#000000;fill-opacity:1;stroke:none;stroke-width:1px;stroke-linecap:butt;stroke-linejoin:miter;stroke-opacity:1"
       xml:space="preserve"><tspan
         y="764.36218"
         x="391"
         id="tspan3372"
         sodipodi:role="line">Angry Birds</tspan></text>
    <rect
       ry="19.792603"
       rx="19.792603"
       y="562.56958"
       x="60.207397"
       height="49.585209"
       width="149.58521"
       id="rect3374"
       style="fill:#4e9a06;stroke:#2e3436;stroke-width:0.41479295" />
    <text
       xml:space="preserve"
       style="font-style:normal;font-variant:normal;font-weight:normal;font-stretch:normal;font-size:30px;line-height:125%;font-family:Karla;-inkscape-font-specification:'Karla, Normal';text-align:start;letter-spacing:0px;word-spacing:0px;writing-mode:lr-tb;text-anchor:start;fill:#000000;fill-opacity:1;stroke:none;stroke-width:1px;stroke-linecap:butt;stroke-linejoin:miter;stroke-opacity:1"
       x="71"
       y="597.36218"
       id="text3376"
       sodipodi:linespacing="125%"><tspan
         sodipodi:role="line"
         id="tspan3378"
         x="71"
         y="597.36218">Yelp</tspan></text>
    <rect
       style="fill:#4e9a06;stroke:#2e3436;stroke-width:0.41479295"
       id="rect3380"
       width="149.58521"
       height="49.585209"
       x="220.2074"
       y="562.56958"
       rx="19.792603"
       ry="19.792603" />
    <text
       sodipodi:linespacing="125%"
       id="text3382"
       y="597.36218"
       x="231"
       style="font-style:normal;font-variant:normal;font-weight:normal;font-stretch:normal;font-size:30px;line-height:125%;font-family:Karla;-inkscape-font-specification:'Karla, Normal';text-align:start;letter-spacing:0px;word-spacing:0px;writing-mode:lr-tb;text-anchor:start;fill:#000000;fill-opacity:1;stroke:none;stroke-width:1px;stroke-linecap:butt;stroke-linejoin:miter;stroke-opacity:1"
       xml:space="preserve"><tspan
         y="597.36218"
         x="231"
         id="tspan3384"
         sodipodi:role="line">Twitter</tspan></text>
    <rect
       ry="19.792603"
       rx="19.792603"
       y="562.56958"
       x="380.2074"
       height="49.585209"
       width="149.58521"
       id="rect3386"
       style="fill:#4e9a06;stroke:#2e3436;stroke-width:0.41479295" />
    <text
       xml:space="preserve"
       style="font-style:normal;font-variant:normal;font-weight:normal;font-stretch:normal;font-size:20px;line-height:125%;font-family:Karla;-inkscape-font-specification:'Karla, Normal';text-align:start;letter-spacing:0px;word-spacing:0px;writing-mode:lr-tb;text-anchor:start;fill:#000000;fill-opacity:1;stroke:none;stroke-width:1px;stroke-linecap:butt;stroke-linejoin:miter;stroke-opacity:1"
       x="351"
       y="644.36218"
       id="text3388"
       sodipodi:linespacing="125%"><tspan
         sodipodi:role="line"
         id="tspan3390"
         x="351"
         y="644.36218" /></text>
    <rect
       style="fill:#4e9a06;stroke:#2e3436;stroke-width:0.41479295"
       id="rect3392"
       width="149.58521"
       height="49.585209"
       x="60.207397"
       y="622.56958"
       rx="19.792603"
       ry="19.792603" />
    <text
       sodipodi:linespacing="125%"
       id="text3394"
       y="657.36218"
       x="71"
       style="font-style:normal;font-variant:normal;font-weight:normal;font-stretch:normal;font-size:30px;line-height:125%;font-family:Karla;-inkscape-font-specification:'Karla, Normal';text-align:start;letter-spacing:0px;word-spacing:0px;writing-mode:lr-tb;text-anchor:start;fill:#000000;fill-opacity:1;stroke:none;stroke-width:1px;stroke-linecap:butt;stroke-linejoin:miter;stroke-opacity:1"
       xml:space="preserve"><tspan
         y="657.36218"
         x="71"
         id="tspan3396"
         sodipodi:role="line">Yahoo!</tspan></text>
    <rect
       ry="19.783764"
       rx="19.783764"
       y="622.56958"
       x="220.2074"
       height="49.585209"
       width="149.58521"
       id="rect3398"
       style="fill:#4e9a06;stroke:#2e3436;stroke-width:0.41479295" />
    <text
       xml:space="preserve"
       style="font-style:normal;font-variant:normal;font-weight:normal;font-stretch:normal;font-size:30px;line-height:125%;font-family:Karla;-inkscape-font-specification:'Karla, Normal';text-align:start;letter-spacing:0px;word-spacing:0px;writing-mode:lr-tb;text-anchor:start;fill:#000000;fill-opacity:1;stroke:none;stroke-width:1px;stroke-linecap:butt;stroke-linejoin:miter;stroke-opacity:1"
       x="231"
       y="657.36218"
       id="text3400"
       sodipodi:linespacing="125%"><tspan
         sodipodi:role="line"
         id="tspan3402"
         x="231"
         y="657.36218">Kindle</tspan></text>
    <rect
       style="fill:#4e9a06;stroke:#2e3436;stroke-width:0.41479295"
       id="rect3404"
       width="149.58521"
       height="49.585209"
       x="380.2074"
       y="622.56958"
       rx="19.792603"
       ry="19.792603" />
    <text
       sodipodi:linespacing="125%"
       id="text3406"
       y="654.36218"
       x="391"
       style="font-style:normal;font-variant:normal;font-weight:normal;font-stretch:normal;font-size:25px;line-height:125%;font-family:Karla;-inkscape-font-specification:'Karla, Normal';text-align:start;letter-spacing:0px;word-spacing:0px;writing-mode:lr-tb;text-anchor:start;fill:#000000;fill-opacity:1;stroke:none;stroke-width:1px;stroke-linecap:butt;stroke-linejoin:miter;stroke-opacity:1"
       xml:space="preserve"><tspan
         y="654.36218"
         x="391"
         id="tspan3408"
         sodipodi:role="line">Foursquare</tspan></text>
    <text
       xml:space="preserve"
       style="font-style:normal;font-variant:normal;font-weight:normal;font-stretch:normal;font-size:30px;line-height:125%;font-family:Karla;-inkscape-font-specification:'Karla, Normal';text-align:start;letter-spacing:0px;word-spacing:0px;writing-mode:lr-tb;text-anchor:start;fill:#000000;fill-opacity:1;stroke:none;stroke-width:1px;stroke-linecap:butt;stroke-linejoin:miter;stroke-opacity:1"
       x="392"
       y="597.36218"
       id="text3410"
       sodipodi:linespacing="125%"><tspan
         sodipodi:role="line"
         id="tspan3412"
         x="392"
         y="597.36218">identi.ca</tspan></text>
    <rect
       style="fill:#5c3566;fill-opacity:0.49717515;stroke:#2e3436;stroke-width:1.00472403"
       id="rect3450"
       width="488.99527"
       height="88.995277"
       x="50.502361"
       y="813.86456"
       rx="20.417339"
       ry="19.776728" />
    <text
       xml:space="preserve"
       style="font-style:normal;font-variant:normal;font-weight:bold;font-stretch:normal;font-size:15px;line-height:125%;font-family:Karla;-inkscape-font-specification:'Karla, Bold';text-align:start;letter-spacing:0px;word-spacing:0px;writing-mode:lr-tb;text-anchor:start;fill:#000000;fill-opacity:1;stroke:none;stroke-width:1px;stroke-linecap:butt;stroke-linejoin:miter;stroke-opacity:1"
       x="61"
       y="834.36218"
       id="text3452"
       sodipodi:linespacing="125%"><tspan
         sodipodi:role="line"
         id="tspan3454"
         x="61"
         y="834.36218">Built-in application bundles</tspan></text>
    <rect
       ry="19.792603"
       rx="19.792603"
       y="843.56958"
       x="60.207397"
       height="49.585209"
       width="149.58521"
       id="rect3456"
       style="fill:#5c3566;stroke:#2e3436;stroke-width:0.41479295" />
    <text
       xml:space="preserve"
       style="font-style:normal;font-variant:normal;font-weight:normal;font-stretch:normal;font-size:30px;line-height:125%;font-family:Karla;-inkscape-font-specification:'Karla, Normal';text-align:start;letter-spacing:0px;word-spacing:0px;writing-mode:lr-tb;text-anchor:start;fill:#000000;fill-opacity:1;stroke:none;stroke-width:1px;stroke-linecap:butt;stroke-linejoin:miter;stroke-opacity:1"
       x="71"
       y="878.36218"
       id="text3458"
       sodipodi:linespacing="125%"><tspan
         sodipodi:role="line"
         id="tspan3460"
         x="71"
         y="878.36218">Browser</tspan></text>
    <rect
       style="fill:#5c3566;stroke:#2e3436;stroke-width:0.41479295"
       id="rect3462"
       width="149.58521"
       height="49.585209"
       x="220.2074"
       y="843.56958"
       rx="19.792603"
       ry="19.792603" />
    <text
       sodipodi:linespacing="125%"
       id="text3464"
       y="878.36218"
       x="231"
       style="font-style:normal;font-variant:normal;font-weight:normal;font-stretch:normal;font-size:30px;line-height:125%;font-family:Karla;-inkscape-font-specification:'Karla, Normal';text-align:start;letter-spacing:0px;word-spacing:0px;writing-mode:lr-tb;text-anchor:start;fill:#000000;fill-opacity:1;stroke:none;stroke-width:1px;stroke-linecap:butt;stroke-linejoin:miter;stroke-opacity:1"
       xml:space="preserve"><tspan
         y="878.36218"
         x="231"
         id="tspan3466"
         sodipodi:role="line">Contacts</tspan></text>
    <rect
       ry="19.792603"
       rx="19.792603"
       y="843.56958"
       x="380.2074"
       height="49.585209"
       width="149.58521"
       id="rect3468"
       style="fill:#5c3566;stroke:#2e3436;stroke-width:0.41479295" />
    <text
       xml:space="preserve"
       style="font-style:normal;font-variant:normal;font-weight:normal;font-stretch:normal;font-size:20px;line-height:125%;font-family:Karla;-inkscape-font-specification:'Karla, Normal';text-align:start;letter-spacing:0px;word-spacing:0px;writing-mode:lr-tb;text-anchor:start;fill:#000000;fill-opacity:1;stroke:none;stroke-width:1px;stroke-linecap:butt;stroke-linejoin:miter;stroke-opacity:1"
       x="391"
       y="875.36218"
       id="text3470"
       sodipodi:linespacing="125%"><tspan
         sodipodi:role="line"
         id="tspan3472"
         x="391"
         y="875.36218">Media player</tspan></text>
    <rect
       ry="19.776728"
       rx="20.417339"
       y="922.86456"
       x="50.502361"
       height="88.995277"
       width="488.99527"
       id="rect3474"
       style="fill:#5c3566;fill-opacity:0.49717515;stroke:#2e3436;stroke-width:1.00472403" />
    <text
       sodipodi:linespacing="125%"
       id="text3476"
       y="943.36218"
       x="61"
       style="font-style:normal;font-variant:normal;font-weight:bold;font-stretch:normal;font-size:15px;line-height:125%;font-family:Karla;-inkscape-font-specification:'Karla, Bold';text-align:start;letter-spacing:0px;word-spacing:0px;writing-mode:lr-tb;text-anchor:start;fill:#000000;fill-opacity:1;stroke:none;stroke-width:1px;stroke-linecap:butt;stroke-linejoin:miter;stroke-opacity:1"
       xml:space="preserve"><tspan
         y="943.36218"
         x="61"
         id="tspan3478"
         sodipodi:role="line">Platform</tspan></text>
    <rect
       style="fill:#5c3566;stroke:#2e3436;stroke-width:0.41479295"
       id="rect3480"
       width="149.58521"
       height="49.585209"
       x="60.207397"
       y="952.56958"
       rx="19.792603"
       ry="19.792603" />
    <text
       sodipodi:linespacing="125%"
       id="text3482"
       y="987.36218"
       x="71"
       style="font-style:normal;font-variant:normal;font-weight:normal;font-stretch:normal;font-size:30px;line-height:125%;font-family:Karla;-inkscape-font-specification:'Karla, Normal';text-align:start;letter-spacing:0px;word-spacing:0px;writing-mode:lr-tb;text-anchor:start;fill:#000000;fill-opacity:1;stroke:none;stroke-width:1px;stroke-linecap:butt;stroke-linejoin:miter;stroke-opacity:1"
       xml:space="preserve"><tspan
         y="987.36218"
         x="71"
         id="tspan3484"
         sodipodi:role="line">libfolks</tspan></text>
    <rect
       ry="19.792603"
       rx="19.792603"
       y="952.56958"
       x="220.2074"
       height="49.585209"
       width="149.58521"
       id="rect3486"
       style="fill:#5c3566;stroke:#2e3436;stroke-width:0.41479295" />
    <text
       xml:space="preserve"
       style="font-style:normal;font-variant:normal;font-weight:normal;font-stretch:normal;font-size:30px;line-height:125%;font-family:Karla;-inkscape-font-specification:'Karla, Normal';text-align:start;letter-spacing:0px;word-spacing:0px;writing-mode:lr-tb;text-anchor:start;fill:#000000;fill-opacity:1;stroke:none;stroke-width:1px;stroke-linecap:butt;stroke-linejoin:miter;stroke-opacity:1"
       x="191"
       y="1047.3622"
       id="text3488"
       sodipodi:linespacing="125%"><tspan
         sodipodi:role="line"
         id="tspan3490"
         x="191"
         y="1047.3622" /></text>
    <rect
       style="fill:#5c3566;stroke:#2e3436;stroke-width:0.41479295"
       id="rect3492"
       width="149.58521"
       height="49.585209"
       x="380.2074"
       y="952.56958"
       rx="19.792603"
       ry="19.792603" />
    <text
       sodipodi:linespacing="125%"
       id="text3494"
       y="984.36218"
       x="231"
       style="font-style:normal;font-variant:normal;font-weight:normal;font-stretch:normal;font-size:20px;line-height:125%;font-family:Karla;-inkscape-font-specification:'Karla, Normal';text-align:start;letter-spacing:0px;word-spacing:0px;writing-mode:lr-tb;text-anchor:start;fill:#000000;fill-opacity:1;stroke:none;stroke-width:1px;stroke-linecap:butt;stroke-linejoin:miter;stroke-opacity:1"
       xml:space="preserve"><tspan
         y="984.36218"
         x="231"
         id="tspan3496"
         sodipodi:role="line">dbus-daemon</tspan></text>
    <text
       xml:space="preserve"
       style="font-style:normal;font-variant:normal;font-weight:normal;font-stretch:normal;font-size:30px;line-height:125%;font-family:Karla;-inkscape-font-specification:'Karla, Normal';text-align:start;letter-spacing:0px;word-spacing:0px;writing-mode:lr-tb;text-anchor:start;fill:#000000;fill-opacity:1;stroke:none;stroke-width:1px;stroke-linecap:butt;stroke-linejoin:miter;stroke-opacity:1"
       x="392"
       y="987.36218"
       id="text3498"
       sodipodi:linespacing="125%"><tspan
         sodipodi:role="line"
         id="tspan3500"
         x="392"
         y="987.36218">systemd</tspan></text>
    <text
       sodipodi:linespacing="125%"
       id="text4308"
       y="28.325218"
       x="-661.56238"
       style="font-style:normal;font-variant:normal;font-weight:bold;font-stretch:normal;font-size:15px;line-height:125%;font-family:Karla;-inkscape-font-specification:'Karla, Bold';text-align:start;letter-spacing:0px;word-spacing:0px;writing-mode:lr-tb;text-anchor:start;fill:#000000;fill-opacity:1;stroke:none;stroke-width:1px;stroke-linecap:butt;stroke-linejoin:miter;stroke-opacity:1"
       xml:space="preserve"
       transform="matrix(0,-1,1,0,0,0)"><tspan
         y="28.325218"
         x="-661.56238"
         id="tspan4310"
         sodipodi:role="line">Application bundles</tspan></text>
    <text
       xml:space="preserve"
       style="font-style:normal;font-variant:normal;font-weight:bold;font-stretch:normal;font-size:15px;line-height:125%;font-family:Karla;-inkscape-font-specification:'Karla, Bold';text-align:start;letter-spacing:0px;word-spacing:0px;writing-mode:lr-tb;text-anchor:start;fill:#000000;fill-opacity:1;stroke:none;stroke-width:1px;stroke-linecap:butt;stroke-linejoin:miter;stroke-opacity:1"
       x="61"
       y="1030.3622"
       id="text4312"
       sodipodi:linespacing="125%"><tspan
         sodipodi:role="line"
         id="tspan4314"
         x="61"
         y="1030.3622">Essential software</tspan></text>
    <text
       xml:space="preserve"
       style="font-style:normal;font-variant:normal;font-weight:normal;font-stretch:normal;font-size:25px;line-height:125%;font-family:Karla;-inkscape-font-specification:'Karla, Normal';text-align:start;letter-spacing:0px;word-spacing:0px;writing-mode:lr-tb;text-anchor:start;fill:#000000;fill-opacity:1;stroke:none;stroke-width:1px;stroke-linecap:butt;stroke-linejoin:miter;stroke-opacity:1"
       x="229"
       y="764.36218"
       id="text4316"
       sodipodi:linespacing="125%"><tspan
         sodipodi:role="line"
         id="tspan4318"
         x="229"
         y="764.36218">Navigation</tspan></text>
  </g>
</svg>
