<?xml version="1.0" encoding="UTF-8" standalone="no"?>
<!-- Created with Inkscape (http://www.inkscape.org/) -->

<svg
   xmlns:dc="http://purl.org/dc/elements/1.1/"
   xmlns:cc="http://creativecommons.org/ns#"
   xmlns:rdf="http://www.w3.org/1999/02/22-rdf-syntax-ns#"
   xmlns:svg="http://www.w3.org/2000/svg"
   xmlns="http://www.w3.org/2000/svg"
   xmlns:sodipodi="http://sodipodi.sourceforge.net/DTD/sodipodi-0.dtd"
   xmlns:inkscape="http://www.inkscape.org/namespaces/inkscape"
   version="1.1"
   id="svg2"
   width="1024"
   height="768"
   viewBox="0 0 1024 768"
   sodipodi:docname="update-rollback-flow.svg"
   inkscape:version="0.92.3 (2405546, 2018-03-11)">
  <metadata
     id="metadata8">
    <rdf:RDF>
      <cc:Work
         rdf:about="">
        <dc:format>image/svg+xml</dc:format>
        <dc:type
           rdf:resource="http://purl.org/dc/dcmitype/StillImage" />
        <dc:title />
      </cc:Work>
    </rdf:RDF>
  </metadata>
  <defs
     id="defs6">
    <marker
       inkscape:isstock="true"
       style="overflow:visible"
       id="marker11281"
       refX="0.0"
       refY="0.0"
       orient="auto"
       inkscape:stockid="TriangleOutL">
      <path
         transform="scale(0.8)"
         style="fill-rule:evenodd;stroke:#000000;stroke-width:1pt;stroke-opacity:1;fill:#000000;fill-opacity:1"
         d="M 5.77,0.0 L -2.88,5.0 L -2.88,-5.0 L 5.77,0.0 z "
         id="path11279" />
    </marker>
    <marker
       inkscape:isstock="true"
       style="overflow:visible"
       id="marker10965"
       refX="0.0"
       refY="0.0"
       orient="auto"
       inkscape:stockid="TriangleOutL">
      <path
         transform="scale(0.8)"
         style="fill-rule:evenodd;stroke:#000000;stroke-width:1pt;stroke-opacity:1;fill:#000000;fill-opacity:1"
         d="M 5.77,0.0 L -2.88,5.0 L -2.88,-5.0 L 5.77,0.0 z "
         id="path10963" />
    </marker>
    <marker
       inkscape:isstock="true"
       style="overflow:visible"
       id="marker10655"
       refX="0.0"
       refY="0.0"
       orient="auto"
       inkscape:stockid="TriangleOutL">
      <path
         transform="scale(0.8)"
         style="fill-rule:evenodd;stroke:#000000;stroke-width:1pt;stroke-opacity:1;fill:#000000;fill-opacity:1"
         d="M 5.77,0.0 L -2.88,5.0 L -2.88,-5.0 L 5.77,0.0 z "
         id="path10653" />
    </marker>
    <marker
       inkscape:isstock="true"
       style="overflow:visible"
       id="marker10351"
       refX="0.0"
       refY="0.0"
       orient="auto"
       inkscape:stockid="TriangleOutL">
      <path
         transform="scale(0.8)"
         style="fill-rule:evenodd;stroke:#000000;stroke-width:1pt;stroke-opacity:1;fill:#000000;fill-opacity:1"
         d="M 5.77,0.0 L -2.88,5.0 L -2.88,-5.0 L 5.77,0.0 z "
         id="path10349" />
    </marker>
    <marker
       inkscape:isstock="true"
       style="overflow:visible"
       id="marker10053"
       refX="0.0"
       refY="0.0"
       orient="auto"
       inkscape:stockid="TriangleOutL">
      <path
         transform="scale(0.8)"
         style="fill-rule:evenodd;stroke:#000000;stroke-width:1pt;stroke-opacity:1;fill:#000000;fill-opacity:1"
         d="M 5.77,0.0 L -2.88,5.0 L -2.88,-5.0 L 5.77,0.0 z "
         id="path10051" />
    </marker>
    <marker
       inkscape:isstock="true"
       style="overflow:visible"
       id="marker9761"
       refX="0.0"
       refY="0.0"
       orient="auto"
       inkscape:stockid="TriangleOutL">
      <path
         transform="scale(0.8)"
         style="fill-rule:evenodd;stroke:#000000;stroke-width:1pt;stroke-opacity:1;fill:#000000;fill-opacity:1"
         d="M 5.77,0.0 L -2.88,5.0 L -2.88,-5.0 L 5.77,0.0 z "
         id="path9759" />
    </marker>
    <marker
       inkscape:isstock="true"
       style="overflow:visible"
       id="marker9475"
       refX="0.0"
       refY="0.0"
       orient="auto"
       inkscape:stockid="TriangleOutL">
      <path
         transform="scale(0.8)"
         style="fill-rule:evenodd;stroke:#000000;stroke-width:1pt;stroke-opacity:1;fill:#000000;fill-opacity:1"
         d="M 5.77,0.0 L -2.88,5.0 L -2.88,-5.0 L 5.77,0.0 z "
         id="path9473" />
    </marker>
    <marker
       inkscape:isstock="true"
       style="overflow:visible"
       id="marker9195"
       refX="0.0"
       refY="0.0"
       orient="auto"
       inkscape:stockid="TriangleOutL">
      <path
         transform="scale(0.8)"
         style="fill-rule:evenodd;stroke:#000000;stroke-width:1pt;stroke-opacity:1;fill:#000000;fill-opacity:1"
         d="M 5.77,0.0 L -2.88,5.0 L -2.88,-5.0 L 5.77,0.0 z "
         id="path9193" />
    </marker>
    <marker
       inkscape:isstock="true"
       style="overflow:visible"
       id="marker8921"
       refX="0.0"
       refY="0.0"
       orient="auto"
       inkscape:stockid="TriangleOutL">
      <path
         transform="scale(0.8)"
         style="fill-rule:evenodd;stroke:#000000;stroke-width:1pt;stroke-opacity:1;fill:#000000;fill-opacity:1"
         d="M 5.77,0.0 L -2.88,5.0 L -2.88,-5.0 L 5.77,0.0 z "
         id="path8919" />
    </marker>
    <marker
       inkscape:isstock="true"
       style="overflow:visible"
       id="marker8653"
       refX="0.0"
       refY="0.0"
       orient="auto"
       inkscape:stockid="TriangleOutL">
      <path
         transform="scale(0.8)"
         style="fill-rule:evenodd;stroke:#000000;stroke-width:1pt;stroke-opacity:1;fill:#000000;fill-opacity:1"
         d="M 5.77,0.0 L -2.88,5.0 L -2.88,-5.0 L 5.77,0.0 z "
         id="path8651" />
    </marker>
    <marker
       inkscape:isstock="true"
       style="overflow:visible"
       id="marker8391"
       refX="0.0"
       refY="0.0"
       orient="auto"
       inkscape:stockid="TriangleOutL">
      <path
         transform="scale(0.8)"
         style="fill-rule:evenodd;stroke:#000000;stroke-width:1pt;stroke-opacity:1;fill:#000000;fill-opacity:1"
         d="M 5.77,0.0 L -2.88,5.0 L -2.88,-5.0 L 5.77,0.0 z "
         id="path8389" />
    </marker>
    <marker
       inkscape:isstock="true"
       style="overflow:visible"
       id="marker8135"
       refX="0.0"
       refY="0.0"
       orient="auto"
       inkscape:stockid="TriangleOutL">
      <path
         transform="scale(0.8)"
         style="fill-rule:evenodd;stroke:#000000;stroke-width:1pt;stroke-opacity:1;fill:#000000;fill-opacity:1"
         d="M 5.77,0.0 L -2.88,5.0 L -2.88,-5.0 L 5.77,0.0 z "
         id="path8133" />
    </marker>
    <marker
       inkscape:isstock="true"
       style="overflow:visible"
       id="marker7885"
       refX="0.0"
       refY="0.0"
       orient="auto"
       inkscape:stockid="TriangleOutL">
      <path
         transform="scale(0.8)"
         style="fill-rule:evenodd;stroke:#000000;stroke-width:1pt;stroke-opacity:1;fill:#000000;fill-opacity:1"
         d="M 5.77,0.0 L -2.88,5.0 L -2.88,-5.0 L 5.77,0.0 z "
         id="path7883" />
    </marker>
    <marker
       inkscape:stockid="TriangleOutL"
       orient="auto"
       refY="0.0"
       refX="0.0"
       id="TriangleOutL"
       style="overflow:visible"
       inkscape:isstock="true"
       inkscape:collect="always">
      <path
         id="path1691"
         d="M 5.77,0.0 L -2.88,5.0 L -2.88,-5.0 L 5.77,0.0 z "
         style="fill-rule:evenodd;stroke:#000000;stroke-width:1pt;stroke-opacity:1;fill:#000000;fill-opacity:1"
         transform="scale(0.8)" />
    </marker>
    <marker
       inkscape:isstock="true"
       style="overflow:visible"
       id="marker7159"
       refX="0.0"
       refY="0.0"
       orient="auto"
       inkscape:stockid="TriangleInL">
      <path
         transform="scale(-0.8)"
         style="fill-rule:evenodd;stroke:#000000;stroke-width:1pt;stroke-opacity:1;fill:#000000;fill-opacity:1"
         d="M 5.77,0.0 L -2.88,5.0 L -2.88,-5.0 L 5.77,0.0 z "
         id="path7157" />
    </marker>
    <marker
       inkscape:isstock="true"
       style="overflow:visible"
       id="marker6921"
       refX="0.0"
       refY="0.0"
       orient="auto"
       inkscape:stockid="TriangleInL">
      <path
         transform="scale(-0.8)"
         style="fill-rule:evenodd;stroke:#000000;stroke-width:1pt;stroke-opacity:1;fill:#000000;fill-opacity:1"
         d="M 5.77,0.0 L -2.88,5.0 L -2.88,-5.0 L 5.77,0.0 z "
         id="path6919" />
    </marker>
    <marker
       inkscape:isstock="true"
       style="overflow:visible"
       id="marker6689"
       refX="0.0"
       refY="0.0"
       orient="auto"
       inkscape:stockid="TriangleInL">
      <path
         transform="scale(-0.8)"
         style="fill-rule:evenodd;stroke:#000000;stroke-width:1pt;stroke-opacity:1;fill:#000000;fill-opacity:1"
         d="M 5.77,0.0 L -2.88,5.0 L -2.88,-5.0 L 5.77,0.0 z "
         id="path6687" />
    </marker>
    <marker
       inkscape:isstock="true"
       style="overflow:visible"
       id="marker6463"
       refX="0.0"
       refY="0.0"
       orient="auto"
       inkscape:stockid="TriangleInL">
      <path
         transform="scale(-0.8)"
         style="fill-rule:evenodd;stroke:#000000;stroke-width:1pt;stroke-opacity:1;fill:#000000;fill-opacity:1"
         d="M 5.77,0.0 L -2.88,5.0 L -2.88,-5.0 L 5.77,0.0 z "
         id="path6461" />
    </marker>
    <marker
       inkscape:isstock="true"
       style="overflow:visible"
       id="marker6243"
       refX="0.0"
       refY="0.0"
       orient="auto"
       inkscape:stockid="TriangleInL">
      <path
         transform="scale(-0.8)"
         style="fill-rule:evenodd;stroke:#000000;stroke-width:1pt;stroke-opacity:1;fill:#000000;fill-opacity:1"
         d="M 5.77,0.0 L -2.88,5.0 L -2.88,-5.0 L 5.77,0.0 z "
         id="path6241" />
    </marker>
    <marker
       inkscape:isstock="true"
       style="overflow:visible"
       id="marker6029"
       refX="0.0"
       refY="0.0"
       orient="auto"
       inkscape:stockid="TriangleInL">
      <path
         transform="scale(-0.8)"
         style="fill-rule:evenodd;stroke:#000000;stroke-width:1pt;stroke-opacity:1;fill:#000000;fill-opacity:1"
         d="M 5.77,0.0 L -2.88,5.0 L -2.88,-5.0 L 5.77,0.0 z "
         id="path6027" />
    </marker>
    <marker
       inkscape:isstock="true"
       style="overflow:visible"
       id="marker5821"
       refX="0.0"
       refY="0.0"
       orient="auto"
       inkscape:stockid="TriangleInL">
      <path
         transform="scale(-0.8)"
         style="fill-rule:evenodd;stroke:#000000;stroke-width:1pt;stroke-opacity:1;fill:#000000;fill-opacity:1"
         d="M 5.77,0.0 L -2.88,5.0 L -2.88,-5.0 L 5.77,0.0 z "
         id="path5819" />
    </marker>
    <marker
       inkscape:isstock="true"
       style="overflow:visible"
       id="marker5619"
       refX="0.0"
       refY="0.0"
       orient="auto"
       inkscape:stockid="TriangleInL">
      <path
         transform="scale(-0.8)"
         style="fill-rule:evenodd;stroke:#000000;stroke-width:1pt;stroke-opacity:1;fill:#000000;fill-opacity:1"
         d="M 5.77,0.0 L -2.88,5.0 L -2.88,-5.0 L 5.77,0.0 z "
         id="path5617" />
    </marker>
    <marker
       inkscape:isstock="true"
       style="overflow:visible"
       id="marker5423"
       refX="0.0"
       refY="0.0"
       orient="auto"
       inkscape:stockid="TriangleInL">
      <path
         transform="scale(-0.8)"
         style="fill-rule:evenodd;stroke:#000000;stroke-width:1pt;stroke-opacity:1;fill:#000000;fill-opacity:1"
         d="M 5.77,0.0 L -2.88,5.0 L -2.88,-5.0 L 5.77,0.0 z "
         id="path5421" />
    </marker>
    <marker
       inkscape:isstock="true"
       style="overflow:visible"
       id="marker5233"
       refX="0.0"
       refY="0.0"
       orient="auto"
       inkscape:stockid="TriangleInL">
      <path
         transform="scale(-0.8)"
         style="fill-rule:evenodd;stroke:#000000;stroke-width:1pt;stroke-opacity:1;fill:#000000;fill-opacity:1"
         d="M 5.77,0.0 L -2.88,5.0 L -2.88,-5.0 L 5.77,0.0 z "
         id="path5231" />
    </marker>
    <marker
       inkscape:isstock="true"
       style="overflow:visible"
       id="marker5049"
       refX="0.0"
       refY="0.0"
       orient="auto"
       inkscape:stockid="TriangleInL">
      <path
         transform="scale(-0.8)"
         style="fill-rule:evenodd;stroke:#000000;stroke-width:1pt;stroke-opacity:1;fill:#000000;fill-opacity:1"
         d="M 5.77,0.0 L -2.88,5.0 L -2.88,-5.0 L 5.77,0.0 z "
         id="path5047" />
    </marker>
    <marker
       inkscape:isstock="true"
       style="overflow:visible"
       id="marker4871"
       refX="0.0"
       refY="0.0"
       orient="auto"
       inkscape:stockid="TriangleInL">
      <path
         transform="scale(-0.8)"
         style="fill-rule:evenodd;stroke:#000000;stroke-width:1pt;stroke-opacity:1;fill:#000000;fill-opacity:1"
         d="M 5.77,0.0 L -2.88,5.0 L -2.88,-5.0 L 5.77,0.0 z "
         id="path4869" />
    </marker>
    <marker
       inkscape:isstock="true"
       style="overflow:visible"
       id="marker4699"
       refX="0.0"
       refY="0.0"
       orient="auto"
       inkscape:stockid="TriangleInL">
      <path
         transform="scale(-0.8)"
         style="fill-rule:evenodd;stroke:#000000;stroke-width:1pt;stroke-opacity:1;fill:#000000;fill-opacity:1"
         d="M 5.77,0.0 L -2.88,5.0 L -2.88,-5.0 L 5.77,0.0 z "
         id="path4697" />
    </marker>
    <marker
       inkscape:stockid="Arrow1Lend"
       orient="auto"
       refY="0.0"
       refX="0.0"
       id="marker4207"
       style="overflow:visible;"
       inkscape:isstock="true">
      <path
         id="path4205"
         d="M 0.0,0.0 L 5.0,-5.0 L -12.5,0.0 L 5.0,5.0 L 0.0,0.0 z "
         style="fill-rule:evenodd;stroke:#000000;stroke-width:1pt;stroke-opacity:1;fill:#000000;fill-opacity:1"
         transform="scale(0.8) rotate(180) translate(12.5,0)" />
    </marker>
    <marker
       inkscape:stockid="Arrow1Lend"
       orient="auto"
       refY="0.0"
       refX="0.0"
       id="marker4047"
       style="overflow:visible;"
       inkscape:isstock="true">
      <path
         id="path4045"
         d="M 0.0,0.0 L 5.0,-5.0 L -12.5,0.0 L 5.0,5.0 L 0.0,0.0 z "
         style="fill-rule:evenodd;stroke:#000000;stroke-width:1pt;stroke-opacity:1;fill:#000000;fill-opacity:1"
         transform="scale(0.8) rotate(180) translate(12.5,0)" />
    </marker>
    <marker
       inkscape:stockid="Arrow1Lend"
       orient="auto"
       refY="0.0"
       refX="0.0"
       id="marker3893"
       style="overflow:visible;"
       inkscape:isstock="true">
      <path
         id="path3891"
         d="M 0.0,0.0 L 5.0,-5.0 L -12.5,0.0 L 5.0,5.0 L 0.0,0.0 z "
         style="fill-rule:evenodd;stroke:#000000;stroke-width:1pt;stroke-opacity:1;fill:#000000;fill-opacity:1"
         transform="scale(0.8) rotate(180) translate(12.5,0)" />
    </marker>
    <marker
       inkscape:stockid="Arrow1Lend"
       orient="auto"
       refY="0.0"
       refX="0.0"
       id="marker3745"
       style="overflow:visible;"
       inkscape:isstock="true">
      <path
         id="path3743"
         d="M 0.0,0.0 L 5.0,-5.0 L -12.5,0.0 L 5.0,5.0 L 0.0,0.0 z "
         style="fill-rule:evenodd;stroke:#000000;stroke-width:1pt;stroke-opacity:1;fill:#000000;fill-opacity:1"
         transform="scale(0.8) rotate(180) translate(12.5,0)" />
    </marker>
    <marker
       inkscape:stockid="Arrow1Lend"
       orient="auto"
       refY="0.0"
       refX="0.0"
       id="marker3603"
       style="overflow:visible;"
       inkscape:isstock="true">
      <path
         id="path3601"
         d="M 0.0,0.0 L 5.0,-5.0 L -12.5,0.0 L 5.0,5.0 L 0.0,0.0 z "
         style="fill-rule:evenodd;stroke:#000000;stroke-width:1pt;stroke-opacity:1;fill:#000000;fill-opacity:1"
         transform="scale(0.8) rotate(180) translate(12.5,0)" />
    </marker>
    <marker
       inkscape:stockid="Arrow1Lend"
       orient="auto"
       refY="0.0"
       refX="0.0"
       id="marker3467"
       style="overflow:visible;"
       inkscape:isstock="true">
      <path
         id="path3465"
         d="M 0.0,0.0 L 5.0,-5.0 L -12.5,0.0 L 5.0,5.0 L 0.0,0.0 z "
         style="fill-rule:evenodd;stroke:#000000;stroke-width:1pt;stroke-opacity:1;fill:#000000;fill-opacity:1"
         transform="scale(0.8) rotate(180) translate(12.5,0)" />
    </marker>
    <marker
       inkscape:stockid="Arrow1Lend"
       orient="auto"
       refY="0.0"
       refX="0.0"
       id="marker3337"
       style="overflow:visible;"
       inkscape:isstock="true">
      <path
         id="path3335"
         d="M 0.0,0.0 L 5.0,-5.0 L -12.5,0.0 L 5.0,5.0 L 0.0,0.0 z "
         style="fill-rule:evenodd;stroke:#000000;stroke-width:1pt;stroke-opacity:1;fill:#000000;fill-opacity:1"
         transform="scale(0.8) rotate(180) translate(12.5,0)" />
    </marker>
    <marker
       inkscape:stockid="Arrow1Lend"
       orient="auto"
       refY="0.0"
       refX="0.0"
       id="marker3213"
       style="overflow:visible;"
       inkscape:isstock="true">
      <path
         id="path3211"
         d="M 0.0,0.0 L 5.0,-5.0 L -12.5,0.0 L 5.0,5.0 L 0.0,0.0 z "
         style="fill-rule:evenodd;stroke:#000000;stroke-width:1pt;stroke-opacity:1;fill:#000000;fill-opacity:1"
         transform="scale(0.8) rotate(180) translate(12.5,0)" />
    </marker>
    <marker
       inkscape:stockid="Arrow1Lend"
       orient="auto"
       refY="0.0"
       refX="0.0"
       id="marker3095"
       style="overflow:visible;"
       inkscape:isstock="true">
      <path
         id="path3093"
         d="M 0.0,0.0 L 5.0,-5.0 L -12.5,0.0 L 5.0,5.0 L 0.0,0.0 z "
         style="fill-rule:evenodd;stroke:#000000;stroke-width:1pt;stroke-opacity:1;fill:#000000;fill-opacity:1"
         transform="scale(0.8) rotate(180) translate(12.5,0)" />
    </marker>
    <marker
       inkscape:stockid="Arrow1Lend"
       orient="auto"
       refY="0.0"
       refX="0.0"
       id="marker2983"
       style="overflow:visible;"
       inkscape:isstock="true">
      <path
         id="path2981"
         d="M 0.0,0.0 L 5.0,-5.0 L -12.5,0.0 L 5.0,5.0 L 0.0,0.0 z "
         style="fill-rule:evenodd;stroke:#000000;stroke-width:1pt;stroke-opacity:1;fill:#000000;fill-opacity:1"
         transform="scale(0.8) rotate(180) translate(12.5,0)" />
    </marker>
    <marker
       inkscape:stockid="Arrow1Lend"
       orient="auto"
       refY="0.0"
       refX="0.0"
       id="marker2877"
       style="overflow:visible;"
       inkscape:isstock="true">
      <path
         id="path2875"
         d="M 0.0,0.0 L 5.0,-5.0 L -12.5,0.0 L 5.0,5.0 L 0.0,0.0 z "
         style="fill-rule:evenodd;stroke:#000000;stroke-width:1pt;stroke-opacity:1;fill:#000000;fill-opacity:1"
         transform="scale(0.8) rotate(180) translate(12.5,0)" />
    </marker>
    <marker
       inkscape:stockid="Arrow1Lend"
       orient="auto"
       refY="0.0"
       refX="0.0"
       id="marker2777"
       style="overflow:visible;"
       inkscape:isstock="true">
      <path
         id="path2775"
         d="M 0.0,0.0 L 5.0,-5.0 L -12.5,0.0 L 5.0,5.0 L 0.0,0.0 z "
         style="fill-rule:evenodd;stroke:#000000;stroke-width:1pt;stroke-opacity:1;fill:#000000;fill-opacity:1"
         transform="scale(0.8) rotate(180) translate(12.5,0)" />
    </marker>
    <marker
       inkscape:stockid="Arrow1Lend"
       orient="auto"
       refY="0.0"
       refX="0.0"
       id="marker2683"
       style="overflow:visible;"
       inkscape:isstock="true">
      <path
         id="path2681"
         d="M 0.0,0.0 L 5.0,-5.0 L -12.5,0.0 L 5.0,5.0 L 0.0,0.0 z "
         style="fill-rule:evenodd;stroke:#000000;stroke-width:1pt;stroke-opacity:1;fill:#000000;fill-opacity:1"
         transform="scale(0.8) rotate(180) translate(12.5,0)" />
    </marker>
    <marker
       inkscape:isstock="true"
       style="overflow:visible;"
       id="marker2405"
       refX="0.0"
       refY="0.0"
       orient="auto"
       inkscape:stockid="Arrow1Lend">
      <path
         transform="scale(0.8) rotate(180) translate(12.5,0)"
         style="fill-rule:evenodd;stroke:#000000;stroke-width:1pt;stroke-opacity:1;fill:#000000;fill-opacity:1"
         d="M 0.0,0.0 L 5.0,-5.0 L -12.5,0.0 L 5.0,5.0 L 0.0,0.0 z "
         id="path2403" />
    </marker>
    <marker
       inkscape:isstock="true"
       style="overflow:visible;"
       id="marker2323"
       refX="0.0"
       refY="0.0"
       orient="auto"
       inkscape:stockid="Arrow1Lend">
      <path
         transform="scale(0.8) rotate(180) translate(12.5,0)"
         style="fill-rule:evenodd;stroke:#000000;stroke-width:1pt;stroke-opacity:1;fill:#000000;fill-opacity:1"
         d="M 0.0,0.0 L 5.0,-5.0 L -12.5,0.0 L 5.0,5.0 L 0.0,0.0 z "
         id="path2321" />
    </marker>
    <marker
       inkscape:isstock="true"
       style="overflow:visible;"
       id="marker2247"
       refX="0.0"
       refY="0.0"
       orient="auto"
       inkscape:stockid="Arrow1Lend">
      <path
         transform="scale(0.8) rotate(180) translate(12.5,0)"
         style="fill-rule:evenodd;stroke:#000000;stroke-width:1pt;stroke-opacity:1;fill:#000000;fill-opacity:1"
         d="M 0.0,0.0 L 5.0,-5.0 L -12.5,0.0 L 5.0,5.0 L 0.0,0.0 z "
         id="path2245" />
    </marker>
    <marker
       inkscape:isstock="true"
       style="overflow:visible;"
       id="marker2177"
       refX="0.0"
       refY="0.0"
       orient="auto"
       inkscape:stockid="Arrow1Lend">
      <path
         transform="scale(0.8) rotate(180) translate(12.5,0)"
         style="fill-rule:evenodd;stroke:#000000;stroke-width:1pt;stroke-opacity:1;fill:#000000;fill-opacity:1"
         d="M 0.0,0.0 L 5.0,-5.0 L -12.5,0.0 L 5.0,5.0 L 0.0,0.0 z "
         id="path2175" />
    </marker>
    <marker
       inkscape:isstock="true"
       style="overflow:visible;"
       id="marker2113"
       refX="0.0"
       refY="0.0"
       orient="auto"
       inkscape:stockid="Arrow1Lend">
      <path
         transform="scale(0.8) rotate(180) translate(12.5,0)"
         style="fill-rule:evenodd;stroke:#000000;stroke-width:1pt;stroke-opacity:1;fill:#000000;fill-opacity:1"
         d="M 0.0,0.0 L 5.0,-5.0 L -12.5,0.0 L 5.0,5.0 L 0.0,0.0 z "
         id="path2111" />
    </marker>
    <marker
       inkscape:isstock="true"
       style="overflow:visible;"
       id="marker2055"
       refX="0.0"
       refY="0.0"
       orient="auto"
       inkscape:stockid="Arrow1Lend">
      <path
         transform="scale(0.8) rotate(180) translate(12.5,0)"
         style="fill-rule:evenodd;stroke:#000000;stroke-width:1pt;stroke-opacity:1;fill:#000000;fill-opacity:1"
         d="M 0.0,0.0 L 5.0,-5.0 L -12.5,0.0 L 5.0,5.0 L 0.0,0.0 z "
         id="path2053" />
    </marker>
    <marker
       inkscape:isstock="true"
       style="overflow:visible;"
       id="marker2003"
       refX="0.0"
       refY="0.0"
       orient="auto"
       inkscape:stockid="Arrow1Lend">
      <path
         transform="scale(0.8) rotate(180) translate(12.5,0)"
         style="fill-rule:evenodd;stroke:#000000;stroke-width:1pt;stroke-opacity:1;fill:#000000;fill-opacity:1"
         d="M 0.0,0.0 L 5.0,-5.0 L -12.5,0.0 L 5.0,5.0 L 0.0,0.0 z "
         id="path2001" />
    </marker>
    <marker
       inkscape:isstock="true"
       style="overflow:visible;"
       id="marker1957"
       refX="0.0"
       refY="0.0"
       orient="auto"
       inkscape:stockid="Arrow1Lend">
      <path
         transform="scale(0.8) rotate(180) translate(12.5,0)"
         style="fill-rule:evenodd;stroke:#000000;stroke-width:1pt;stroke-opacity:1;fill:#000000;fill-opacity:1"
         d="M 0.0,0.0 L 5.0,-5.0 L -12.5,0.0 L 5.0,5.0 L 0.0,0.0 z "
         id="path1955" />
    </marker>
    <marker
       inkscape:isstock="true"
       style="overflow:visible;"
       id="marker1917"
       refX="0.0"
       refY="0.0"
       orient="auto"
       inkscape:stockid="Arrow1Lend">
      <path
         transform="scale(0.8) rotate(180) translate(12.5,0)"
         style="fill-rule:evenodd;stroke:#000000;stroke-width:1pt;stroke-opacity:1;fill:#000000;fill-opacity:1"
         d="M 0.0,0.0 L 5.0,-5.0 L -12.5,0.0 L 5.0,5.0 L 0.0,0.0 z "
         id="path1915" />
    </marker>
    <marker
       inkscape:isstock="true"
       style="overflow:visible;"
       id="marker1883"
       refX="0.0"
       refY="0.0"
       orient="auto"
       inkscape:stockid="Arrow1Lend">
      <path
         transform="scale(0.8) rotate(180) translate(12.5,0)"
         style="fill-rule:evenodd;stroke:#000000;stroke-width:1pt;stroke-opacity:1;fill:#000000;fill-opacity:1"
         d="M 0.0,0.0 L 5.0,-5.0 L -12.5,0.0 L 5.0,5.0 L 0.0,0.0 z "
         id="path1881" />
    </marker>
    <marker
       inkscape:isstock="true"
       style="overflow:visible;"
       id="marker1855"
       refX="0.0"
       refY="0.0"
       orient="auto"
       inkscape:stockid="Arrow1Lend">
      <path
         transform="scale(0.8) rotate(180) translate(12.5,0)"
         style="fill-rule:evenodd;stroke:#000000;stroke-width:1pt;stroke-opacity:1;fill:#000000;fill-opacity:1"
         d="M 0.0,0.0 L 5.0,-5.0 L -12.5,0.0 L 5.0,5.0 L 0.0,0.0 z "
         id="path1853" />
    </marker>
    <marker
       inkscape:isstock="true"
       style="overflow:visible;"
       id="marker1833"
       refX="0.0"
       refY="0.0"
       orient="auto"
       inkscape:stockid="Arrow1Lend">
      <path
         transform="scale(0.8) rotate(180) translate(12.5,0)"
         style="fill-rule:evenodd;stroke:#000000;stroke-width:1pt;stroke-opacity:1;fill:#000000;fill-opacity:1"
         d="M 0.0,0.0 L 5.0,-5.0 L -12.5,0.0 L 5.0,5.0 L 0.0,0.0 z "
         id="path1831" />
    </marker>
    <marker
       inkscape:isstock="true"
       style="overflow:visible"
       id="marker9475-5"
       refX="0"
       refY="0"
       orient="auto"
       inkscape:stockid="TriangleOutL">
      <path
         inkscape:connector-curvature="0"
         transform="scale(0.8)"
         style="fill:#000000;fill-opacity:1;fill-rule:evenodd;stroke:#000000;stroke-width:1.00000003pt;stroke-opacity:1"
         d="M 5.77,0 -2.88,5 V -5 Z"
         id="path9473-6" />
    </marker>
    <marker
       inkscape:isstock="true"
       style="overflow:visible"
       id="marker9195-9"
       refX="0"
       refY="0"
       orient="auto"
       inkscape:stockid="TriangleOutL">
      <path
         inkscape:connector-curvature="0"
         transform="scale(0.8)"
         style="fill:#000000;fill-opacity:1;fill-rule:evenodd;stroke:#000000;stroke-width:1.00000003pt;stroke-opacity:1"
         d="M 5.77,0 -2.88,5 V -5 Z"
         id="path9193-4" />
    </marker>
    <marker
       inkscape:isstock="true"
       style="overflow:visible"
       id="marker9195-1"
       refX="0"
       refY="0"
       orient="auto"
       inkscape:stockid="TriangleOutL">
      <path
         inkscape:connector-curvature="0"
         transform="scale(0.8)"
         style="fill:#000000;fill-opacity:1;fill-rule:evenodd;stroke:#000000;stroke-width:1.00000003pt;stroke-opacity:1"
         d="M 5.77,0 -2.88,5 V -5 Z"
         id="path9193-2" />
    </marker>
  </defs>
  <sodipodi:namedview
     pagecolor="#ffffff"
     bordercolor="#666666"
     borderopacity="1"
     objecttolerance="10"
     gridtolerance="10"
     guidetolerance="10"
     inkscape:pageopacity="0"
     inkscape:pageshadow="2"
     inkscape:window-width="3200"
     inkscape:window-height="1671"
     id="namedview4"
     showgrid="false"
     inkscape:lockguides="false"
     inkscape:snap-midpoints="true"
     inkscape:object-paths="false"
     inkscape:snap-nodes="true"
     inkscape:zoom="1.7383042"
     inkscape:cx="384.21813"
     inkscape:cy="388.39557"
     inkscape:window-x="0"
     inkscape:window-y="55"
     inkscape:window-maximized="1"
     inkscape:current-layer="svg2"
     showguides="false" />
  <rect
     style="color:#000000;clip-rule:nonzero;display:inline;overflow:visible;visibility:visible;opacity:1;isolation:auto;mix-blend-mode:normal;color-interpolation:sRGB;color-interpolation-filters:linearRGB;solid-color:#000000;solid-opacity:1;vector-effect:none;fill:#fffcfc;fill-opacity:1;fill-rule:nonzero;stroke:none;stroke-width:4.05676031;stroke-linecap:butt;stroke-linejoin:miter;stroke-miterlimit:4;stroke-dasharray:none;stroke-dashoffset:0;stroke-opacity:1;marker:none;marker-start:none;marker-mid:none;marker-end:none;color-rendering:auto;image-rendering:auto;shape-rendering:auto;text-rendering:auto;enable-background:accumulate"
     id="rect18370"
     width="1024"
     height="768"
     x="0"
     y="-1.1368684e-13" />
  <rect
     style="color:#000000;clip-rule:nonzero;display:inline;overflow:visible;visibility:visible;opacity:1;isolation:auto;mix-blend-mode:normal;color-interpolation:sRGB;color-interpolation-filters:linearRGB;solid-color:#000000;solid-opacity:1;vector-effect:none;fill:#e3e3e3;fill-opacity:1;fill-rule:nonzero;stroke:#2c2c2c;stroke-width:2.55500627;stroke-linecap:butt;stroke-linejoin:miter;stroke-miterlimit:4;stroke-dasharray:none;stroke-dashoffset:0;stroke-opacity:1;marker:none;marker-start:none;marker-mid:none;marker-end:none;color-rendering:auto;image-rendering:auto;shape-rendering:auto;text-rendering:auto;enable-background:accumulate"
     id="rect817"
     width="114.32573"
     height="62.35947"
     x="113.69463"
     y="50.343445"
     ry="11.432571" />
  <rect
     style="color:#000000;clip-rule:nonzero;display:inline;overflow:visible;visibility:visible;opacity:1;isolation:auto;mix-blend-mode:normal;color-interpolation:sRGB;color-interpolation-filters:linearRGB;solid-color:#000000;solid-opacity:1;vector-effect:none;fill:#e3e3e3;fill-opacity:1;fill-rule:nonzero;stroke:#2c2c2c;stroke-width:2.55500627;stroke-linecap:butt;stroke-linejoin:miter;stroke-miterlimit:4;stroke-dasharray:none;stroke-dashoffset:0;stroke-opacity:1;marker:none;marker-start:none;marker-mid:none;marker-end:none;color-rendering:auto;image-rendering:auto;shape-rendering:auto;text-rendering:auto;enable-background:accumulate"
     id="rect817-3"
     width="232.80872"
     height="90.940895"
     x="42.197746"
     y="163.11014"
     ry="11.432571" />
  <rect
     style="color:#000000;clip-rule:nonzero;display:inline;overflow:visible;visibility:visible;opacity:1;isolation:auto;mix-blend-mode:normal;color-interpolation:sRGB;color-interpolation-filters:linearRGB;solid-color:#000000;solid-opacity:1;vector-effect:none;fill:#e3e3e3;fill-opacity:1;fill-rule:nonzero;stroke:#2c2c2c;stroke-width:2.55500627;stroke-linecap:butt;stroke-linejoin:miter;stroke-miterlimit:4;stroke-dasharray:none;stroke-dashoffset:0;stroke-opacity:1;marker:none;marker-start:none;marker-mid:none;marker-end:none;color-rendering:auto;image-rendering:auto;shape-rendering:auto;text-rendering:auto;enable-background:accumulate"
     id="rect817-6"
     width="163.17397"
     height="71.193764"
     x="44.752743"
     y="304.97794"
     ry="11.432571" />
  <rect
     style="color:#000000;clip-rule:nonzero;display:inline;overflow:visible;visibility:visible;opacity:1;isolation:auto;mix-blend-mode:normal;color-interpolation:sRGB;color-interpolation-filters:linearRGB;solid-color:#000000;solid-opacity:1;vector-effect:none;fill:#e3e3e3;fill-opacity:1;fill-rule:nonzero;stroke:#2c2c2c;stroke-width:2.55500627;stroke-linecap:butt;stroke-linejoin:miter;stroke-miterlimit:4;stroke-dasharray:none;stroke-dashoffset:0;stroke-opacity:1;marker:none;marker-start:none;marker-mid:none;marker-end:none;color-rendering:auto;image-rendering:auto;shape-rendering:auto;text-rendering:auto;enable-background:accumulate"
     id="rect817-5"
     width="142.90717"
     height="62.359467"
     x="54.886139"
     y="426.57895"
     ry="11.432571" />
  <rect
     style="color:#000000;clip-rule:nonzero;display:inline;overflow:visible;visibility:visible;opacity:1;isolation:auto;mix-blend-mode:normal;color-interpolation:sRGB;color-interpolation-filters:linearRGB;solid-color:#000000;solid-opacity:1;vector-effect:none;fill:#e3e3e3;fill-opacity:1;fill-rule:nonzero;stroke:#2c2c2c;stroke-width:2.55500627;stroke-linecap:butt;stroke-linejoin:miter;stroke-miterlimit:4;stroke-dasharray:none;stroke-dashoffset:0;stroke-opacity:1;marker:none;marker-start:none;marker-mid:none;marker-end:none;color-rendering:auto;image-rendering:auto;shape-rendering:auto;text-rendering:auto;enable-background:accumulate"
     id="rect817-35"
     width="164.14841"
     height="71.076607"
     x="44.26553"
     y="539.34564"
     ry="11.432571" />
  <rect
     style="color:#000000;clip-rule:nonzero;display:inline;overflow:visible;visibility:visible;opacity:1;isolation:auto;mix-blend-mode:normal;color-interpolation:sRGB;color-interpolation-filters:linearRGB;solid-color:#000000;solid-opacity:1;vector-effect:none;fill:#e3e3e3;fill-opacity:1;fill-rule:nonzero;stroke:#2c2c2c;stroke-width:2.55500627;stroke-linecap:butt;stroke-linejoin:miter;stroke-miterlimit:4;stroke-dasharray:none;stroke-dashoffset:0;stroke-opacity:1;marker:none;marker-start:none;marker-mid:none;marker-end:none;color-rendering:auto;image-rendering:auto;shape-rendering:auto;text-rendering:auto;enable-background:accumulate"
     id="rect817-9"
     width="167.33133"
     height="37.415691"
     x="297.04877"
     y="556.17609"
     ry="11.432571" />
  <rect
     style="color:#000000;clip-rule:nonzero;display:inline;overflow:visible;visibility:visible;opacity:1;isolation:auto;mix-blend-mode:normal;color-interpolation:sRGB;color-interpolation-filters:linearRGB;solid-color:#000000;solid-opacity:1;vector-effect:none;fill:#e3e3e3;fill-opacity:1;fill-rule:nonzero;stroke:#2c2c2c;stroke-width:2.55500627;stroke-linecap:butt;stroke-linejoin:miter;stroke-miterlimit:4;stroke-dasharray:none;stroke-dashoffset:0;stroke-opacity:1;marker:none;marker-start:none;marker-mid:none;marker-end:none;color-rendering:auto;image-rendering:auto;shape-rendering:auto;text-rendering:auto;enable-background:accumulate"
     id="rect817-1"
     width="205.26665"
     height="95.617859"
     x="278.08109"
     y="664.78125"
     ry="11.432571" />
  <rect
     style="color:#000000;clip-rule:nonzero;display:inline;overflow:visible;visibility:visible;opacity:1;isolation:auto;mix-blend-mode:normal;color-interpolation:sRGB;color-interpolation-filters:linearRGB;solid-color:#000000;solid-opacity:1;vector-effect:none;fill:#e3e3e3;fill-opacity:1;fill-rule:nonzero;stroke:#2c2c2c;stroke-width:2.55500627;stroke-linecap:butt;stroke-linejoin:miter;stroke-miterlimit:4;stroke-dasharray:none;stroke-dashoffset:0;stroke-opacity:1;marker:none;marker-start:none;marker-mid:none;marker-end:none;color-rendering:auto;image-rendering:auto;shape-rendering:auto;text-rendering:auto;enable-background:accumulate"
     id="rect817-2"
     width="182.40143"
     height="53.005409"
     x="560.34442"
     y="686.08752"
     ry="11.432571" />
  <rect
     style="color:#000000;clip-rule:nonzero;display:inline;overflow:visible;visibility:visible;opacity:1;isolation:auto;mix-blend-mode:normal;color-interpolation:sRGB;color-interpolation-filters:linearRGB;solid-color:#000000;solid-opacity:1;vector-effect:none;fill:#e3e3e3;fill-opacity:1;fill-rule:nonzero;stroke:#2c2c2c;stroke-width:2.55500627;stroke-linecap:butt;stroke-linejoin:miter;stroke-miterlimit:4;stroke-dasharray:none;stroke-dashoffset:0;stroke-opacity:1;marker:none;marker-start:none;marker-mid:none;marker-end:none;color-rendering:auto;image-rendering:auto;shape-rendering:auto;text-rendering:auto;enable-background:accumulate"
     id="rect817-70"
     width="186.03906"
     height="51.446548"
     x="558.52557"
     y="549.16071"
     ry="11.432571" />
  <rect
     style="color:#000000;clip-rule:nonzero;display:inline;overflow:visible;visibility:visible;opacity:1;isolation:auto;mix-blend-mode:normal;color-interpolation:sRGB;color-interpolation-filters:linearRGB;solid-color:#000000;solid-opacity:1;vector-effect:none;fill:#e3e3e3;fill-opacity:1;fill-rule:nonzero;stroke:#2c2c2c;stroke-width:2.55500627;stroke-linecap:butt;stroke-linejoin:miter;stroke-miterlimit:4;stroke-dasharray:none;stroke-dashoffset:0;stroke-opacity:1;marker:none;marker-start:none;marker-mid:none;marker-end:none;color-rendering:auto;image-rendering:auto;shape-rendering:auto;text-rendering:auto;enable-background:accumulate"
     id="rect817-6-6"
     width="181.88184"
     height="71.713409"
     x="289.77353"
     y="305.95572"
     ry="11.432571" />
  <text
     xml:space="preserve"
     style="font-style:normal;font-variant:normal;font-weight:normal;font-stretch:normal;font-size:16.18170738px;line-height:125%;font-family:'DejaVu Sans';-inkscape-font-specification:'DejaVu Sans';text-align:start;letter-spacing:0px;word-spacing:0px;text-anchor:start;fill:#000000;fill-opacity:1;stroke:none;stroke-width:1.27750325px;stroke-linecap:butt;stroke-linejoin:miter;stroke-opacity:1"
     x="85.441292"
     y="75.87381"
     id="text1500"><tspan
       sodipodi:role="line"
       x="130.36766"
       y="75.87381"
       id="tspan1494"
       style="text-align:start;text-anchor:start;stroke-width:1.27750325px"><tspan
         x="130.36766"
         y="75.87381"
         id="tspan1492"
         style="text-align:start;text-anchor:start;stroke-width:1.27750325px">Firmware</tspan></tspan><tspan
       sodipodi:role="line"
       x="143.21506"
       y="96.100952"
       id="tspan1498"
       style="text-align:start;text-anchor:start;stroke-width:1.27750325px"><tspan
         x="143.21506"
         y="96.100952"
         id="tspan1496"
         style="text-align:start;text-anchor:start;stroke-width:1.27750325px">begins</tspan></tspan></text>
  <text
     xml:space="preserve"
     style="font-style:normal;font-variant:normal;font-weight:normal;font-stretch:normal;font-size:16.18170738px;line-height:125%;font-family:'DejaVu Sans';-inkscape-font-specification:'DejaVu Sans';text-align:start;letter-spacing:0px;word-spacing:0px;text-anchor:start;fill:#000000;fill-opacity:1;stroke:none;stroke-width:1.27750325px;stroke-linecap:butt;stroke-linejoin:miter;stroke-opacity:1;"
     x="-30.407015"
     y="183.32039"
     id="text1490"><tspan
       sodipodi:role="line"
       x="100.01849"
       y="183.32039"
       id="tspan1474"
       style="text-align:start;text-anchor:start;stroke-width:1.27750325px;"><tspan
         x="97.442696"
         y="183.32039"
         style="font-size:16.18170738px;line-height:125%;text-align:start;text-anchor:start;stroke-width:1.27750325px;"
         id="tspan1472">Did the current </tspan></tspan><tspan
       sodipodi:role="line"
       x="59.674828"
       y="203.54752"
       id="tspan1480"
       style="text-align:start;text-anchor:start;stroke-width:1.27750325px;"><tspan
         x="59.674831"
         y="203.54752"
         style="font-size:16.18170738px;line-height:125%;text-align:start;text-anchor:start;stroke-width:1.27750325px;"
         id="tspan1476">deployment fail to boot?</tspan><tspan
         dx="0"
         x="257.77435"
         y="203.54752"
         style="font-size:16.18170738px;line-height:125%;text-align:start;text-anchor:start;stroke-width:1.27750325px;"
         id="tspan1478" /></tspan><tspan
       sodipodi:role="line"
       x="86.001709"
       y="223.77466"
       id="tspan1484"
       style="text-align:start;text-anchor:start;stroke-width:1.27750325px;"><tspan
         x="83.425911"
         y="223.77466"
         style="font-size:16.18170738px;line-height:125%;text-align:start;text-anchor:start;stroke-width:1.27750325px;"
         id="tspan1482">(i.e. bootcount &gt;= </tspan></tspan><tspan
       sodipodi:role="line"
       x="119.56612"
       y="244.0018"
       id="tspan1488"
       style="text-align:start;text-anchor:start;stroke-width:1.27750325px;"><tspan
         x="119.56612"
         y="244.0018"
         style="font-size:16.18170738px;line-height:125%;text-align:start;text-anchor:start;stroke-width:1.27750325px;"
         id="tspan1486">bootlimit)</tspan></tspan></text>
  <text
     xml:space="preserve"
     style="font-style:normal;font-variant:normal;font-weight:normal;font-stretch:normal;font-size:16.18170738px;line-height:125%;font-family:'DejaVu Sans';-inkscape-font-specification:'DejaVu Sans';text-align:start;letter-spacing:0px;word-spacing:0px;text-anchor:start;opacity:1;vector-effect:none;fill:#000000;fill-opacity:1;stroke:none;stroke-width:1.27750325px;stroke-linecap:butt;stroke-linejoin:miter;stroke-miterlimit:4;stroke-dasharray:none;stroke-dashoffset:0;stroke-opacity:1;"
     x="-15.187003"
     y="334.92545"
     id="text1470"><tspan
       sodipodi:role="line"
       x="61.830185"
       y="334.92545"
       id="tspan1464"
       style="text-align:start;text-anchor:start;stroke-width:1.27750325px;"><tspan
         x="59.254383"
         y="334.92545"
         id="tspan1462"
         style="text-align:start;text-anchor:start;stroke-width:1.27750325px;">Boot the current </tspan></tspan><tspan
       sodipodi:role="line"
       x="79.718559"
       y="355.15259"
       id="tspan1468"
       style="text-align:start;text-anchor:start;stroke-width:1.27750325px;"><tspan
         x="77.142761"
         y="355.15259"
         id="tspan1466"
         style="text-align:start;text-anchor:start;stroke-width:1.27750325px;">deployment </tspan></tspan></text>
  <text
     xml:space="preserve"
     style="font-style:normal;font-variant:normal;font-weight:normal;font-stretch:normal;font-size:16.18170738px;line-height:125%;font-family:'DejaVu Sans';-inkscape-font-specification:'DejaVu Sans';text-align:start;letter-spacing:0px;word-spacing:0px;text-anchor:start;fill:#000000;fill-opacity:1;stroke:none;stroke-width:1.27750325px;stroke-linecap:butt;stroke-linejoin:miter;stroke-opacity:1;"
     x="31.098362"
     y="453.6777"
     id="text1436"><tspan
       sodipodi:role="line"
       x="85.557556"
       y="453.6777"
       id="tspan1430"
       style="text-align:start;text-anchor:start;stroke-width:1.27750325px;"><tspan
         x="82.981758"
         y="453.6777"
         id="tspan1428"
         style="text-align:start;text-anchor:start;stroke-width:1.27750325px;">Successful </tspan></tspan><tspan
       sodipodi:role="line"
       x="103.30373"
       y="473.90485"
       id="tspan1434"
       style="text-align:start;text-anchor:start;stroke-width:1.27750325px;"><tspan
         x="103.30373"
         y="473.90485"
         id="tspan1432"
         style="text-align:start;text-anchor:start;stroke-width:1.27750325px;">boot?</tspan></tspan></text>
  <text
     xml:space="preserve"
     style="font-style:normal;font-variant:normal;font-weight:normal;font-stretch:normal;font-size:16.18170738px;line-height:125%;font-family:'DejaVu Sans';-inkscape-font-specification:'DejaVu Sans';text-align:start;letter-spacing:0px;word-spacing:0px;text-anchor:start;fill:#000000;fill-opacity:1;stroke:none;stroke-width:1.27750325px;stroke-linecap:butt;stroke-linejoin:miter;stroke-opacity:1;"
     x="-43.429916"
     y="558.89581"
     id="text1426"><tspan
       sodipodi:role="line"
       x="62.414875"
       y="558.89581"
       id="tspan1416"
       style="text-align:start;text-anchor:start;stroke-width:1.27750325px;"><tspan
         x="59.839077"
         y="558.89581"
         id="tspan1414"
         style="text-align:start;text-anchor:start;stroke-width:1.27750325px;">Reset bootcount </tspan></tspan><tspan
       sodipodi:role="line"
       x="113.42518"
       y="579.12299"
       id="tspan1420"
       style="text-align:start;text-anchor:start;stroke-width:1.27750325px;"><tspan
         x="110.84938"
         y="579.12299"
         id="tspan1418"
         style="text-align:start;text-anchor:start;stroke-width:1.27750325px;">and </tspan></tspan><tspan
       sodipodi:role="line"
       x="51.700825"
       y="599.3501"
       id="tspan1424"
       style="text-align:start;text-anchor:start;stroke-width:1.27750325px;"><tspan
         x="51.700825"
         y="599.3501"
         id="tspan1422"
         style="text-align:start;text-anchor:start;stroke-width:1.27750325px;">upgrade_available</tspan></tspan></text>
  <text
     xml:space="preserve"
     style="font-style:normal;font-variant:normal;font-weight:normal;font-stretch:normal;font-size:16.18170738px;line-height:125%;font-family:'DejaVu Sans';-inkscape-font-specification:'DejaVu Sans';text-align:start;letter-spacing:0px;word-spacing:0px;text-anchor:start;fill:#000000;fill-opacity:1;stroke:none;stroke-width:1.27750325px;stroke-linecap:butt;stroke-linejoin:miter;stroke-opacity:1;"
     x="233.63315"
     y="579.34814"
     id="text1412"><tspan
       sodipodi:role="line"
       x="306.71948"
       y="579.34814"
       id="tspan1410"
       style="text-align:start;text-anchor:start;stroke-width:1.27750325px;"><tspan
         x="306.71948"
         y="579.34814"
         id="tspan1408"
         style="text-align:start;text-anchor:start;stroke-width:1.27750325px;">Check for updates</tspan></tspan></text>
  <text
     xml:space="preserve"
     style="font-style:normal;font-variant:normal;font-weight:normal;font-stretch:normal;font-size:16.18170738px;line-height:125%;font-family:'DejaVu Sans';-inkscape-font-specification:'DejaVu Sans';text-align:start;letter-spacing:0px;word-spacing:0px;text-anchor:start;fill:#000000;fill-opacity:1;stroke:none;stroke-width:1.27750325px;stroke-linecap:butt;stroke-linejoin:miter;stroke-opacity:1;"
     x="231.62231"
     y="696.82733"
     id="text1396"><tspan
       sodipodi:role="line"
       x="314.57727"
       y="696.82733"
       id="tspan1386"
       style="text-align:start;text-anchor:start;stroke-width:1.27750325px;"><tspan
         x="312.00146"
         y="696.82733"
         id="tspan1384"
         style="text-align:start;text-anchor:start;stroke-width:1.27750325px;">Import update in </tspan></tspan><tspan
       sodipodi:role="line"
       x="316.8212"
       y="717.05444"
       id="tspan1390"
       style="text-align:start;text-anchor:start;stroke-width:1.27750325px;"><tspan
         x="314.24539"
         y="717.05444"
         id="tspan1388"
         style="text-align:start;text-anchor:start;stroke-width:1.27750325px;">the local OSTree </tspan></tspan><tspan
       sodipodi:role="line"
       x="338.99203"
       y="737.28162"
       id="tspan1394"
       style="text-align:start;text-anchor:start;stroke-width:1.27750325px;"><tspan
         x="338.99203"
         y="737.28162"
         id="tspan1392"
         style="text-align:start;text-anchor:start;stroke-width:1.27750325px;">repository</tspan></tspan></text>
  <text
     xml:space="preserve"
     style="font-style:normal;font-variant:normal;font-weight:normal;font-stretch:normal;font-size:16.18170738px;line-height:125%;font-family:'DejaVu Sans';-inkscape-font-specification:'DejaVu Sans';text-align:start;letter-spacing:0px;word-spacing:0px;text-anchor:start;fill:#000000;fill-opacity:1;stroke:none;stroke-width:1.27750325px;stroke-linecap:butt;stroke-linejoin:miter;stroke-opacity:1;"
     x="453.28757"
     y="706.94092"
     id="text1382"><tspan
       sodipodi:role="line"
       x="564.31958"
       y="706.94092"
       id="tspan1376"
       style="text-align:start;text-anchor:start;stroke-width:1.27750325px;"><tspan
         x="561.74377"
         y="706.94092"
         id="tspan1374"
         style="text-align:start;text-anchor:start;stroke-width:1.27750325px;">Successfully imported </tspan></tspan><tspan
       sodipodi:role="line"
       x="602.32446"
       y="727.16803"
       id="tspan1380"
       style="text-align:start;text-anchor:start;stroke-width:1.27750325px;"><tspan
         x="602.32446"
         y="727.16803"
         id="tspan1378"
         style="text-align:start;text-anchor:start;stroke-width:1.27750325px;">the update?</tspan></tspan></text>
  <text
     xml:space="preserve"
     style="font-style:normal;font-variant:normal;font-weight:normal;font-stretch:normal;font-size:16.18170738px;line-height:125%;font-family:'DejaVu Sans';-inkscape-font-specification:'DejaVu Sans';text-align:start;letter-spacing:0px;word-spacing:0px;text-anchor:start;fill:#000000;fill-opacity:1;stroke:none;stroke-width:1.27750325px;stroke-linecap:butt;stroke-linejoin:miter;stroke-opacity:1;"
     x="511.62234"
     y="569.23462"
     id="text1406"><tspan
       sodipodi:role="line"
       x="588.44202"
       y="569.23462"
       id="tspan1400"
       style="text-align:start;text-anchor:start;stroke-width:1.27750325px;"><tspan
         x="585.86621"
         y="569.23462"
         id="tspan1398"
         style="text-align:start;text-anchor:start;stroke-width:1.27750325px;">Blacklist update </tspan></tspan><tspan
       sodipodi:role="line"
       x="606.56738"
       y="589.46173"
       id="tspan1404"
       style="text-align:start;text-anchor:start;stroke-width:1.27750325px;"><tspan
         x="606.56738"
         y="589.46173"
         id="tspan1402"
         style="text-align:start;text-anchor:start;stroke-width:1.27750325px;">and drop it</tspan></tspan></text>
  <text
     xml:space="preserve"
     style="font-style:normal;font-variant:normal;font-weight:normal;font-stretch:normal;font-size:16.18170738px;line-height:125%;font-family:'DejaVu Sans';-inkscape-font-specification:'DejaVu Sans';text-align:start;letter-spacing:0px;word-spacing:0px;text-anchor:start;opacity:1;vector-effect:none;fill:#000000;fill-opacity:1;stroke:none;stroke-width:1.27750325px;stroke-linecap:butt;stroke-linejoin:miter;stroke-miterlimit:4;stroke-dasharray:none;stroke-dashoffset:0;stroke-opacity:1;"
     x="232.66919"
     y="336.16302"
     id="text1460"><tspan
       sodipodi:role="line"
       x="313.5975"
       y="336.16302"
       id="tspan1454"
       style="text-align:start;text-anchor:start;stroke-width:1.27750325px;"><tspan
         x="311.0217"
         y="336.16302"
         id="tspan1452"
         style="text-align:start;text-anchor:start;stroke-width:1.27750325px;">Boot the rollback </tspan></tspan><tspan
       sodipodi:role="line"
       x="334.09329"
       y="356.39017"
       id="tspan1458"
       style="text-align:start;text-anchor:start;stroke-width:1.27750325px;"><tspan
         x="331.51749"
         y="356.39017"
         id="tspan1456"
         style="text-align:start;text-anchor:start;stroke-width:1.27750325px;">deployment </tspan></tspan></text>
  <rect
     style="color:#000000;clip-rule:nonzero;display:inline;overflow:visible;visibility:visible;opacity:1;isolation:auto;mix-blend-mode:normal;color-interpolation:sRGB;color-interpolation-filters:linearRGB;solid-color:#000000;solid-opacity:1;vector-effect:none;fill:#e3e3e3;fill-opacity:1;fill-rule:nonzero;stroke:#2c2c2c;stroke-width:2.55500627;stroke-linecap:butt;stroke-linejoin:miter;stroke-miterlimit:4;stroke-dasharray:none;stroke-dashoffset:0;stroke-opacity:1;marker:none;marker-start:none;marker-mid:none;marker-end:none;color-rendering:auto;image-rendering:auto;shape-rendering:auto;text-rendering:auto;enable-background:accumulate"
     id="rect817-6-6-2"
     width="181.88184"
     height="71.713409"
     x="289.77353"
     y="427.9675"
     ry="11.432571" />
  <text
     xml:space="preserve"
     style="font-style:normal;font-variant:normal;font-weight:normal;font-stretch:normal;font-size:16.18170738px;line-height:125%;font-family:'DejaVu Sans';-inkscape-font-specification:'DejaVu Sans';text-align:start;letter-spacing:0px;word-spacing:0px;text-anchor:start;opacity:1;vector-effect:none;fill:#000000;fill-opacity:1;stroke:none;stroke-width:1.27750325px;stroke-linecap:butt;stroke-linejoin:miter;stroke-miterlimit:4;stroke-dasharray:none;stroke-dashoffset:0;stroke-opacity:1;"
     x="215.84354"
     y="448.06125"
     id="text1450"><tspan
       sodipodi:role="line"
       x="300.30765"
       y="448.06125"
       id="tspan1440"
       style="text-align:start;text-anchor:start;stroke-width:1.27750325px;"><tspan
         x="297.73184"
         y="448.06125"
         id="tspan1438"
         style="text-align:start;text-anchor:start;stroke-width:1.27750325px;">If upgrade_available </tspan></tspan><tspan
       sodipodi:role="line"
       x="300.62369"
       y="468.28839"
       id="tspan1444"
       style="text-align:start;text-anchor:start;stroke-width:1.27750325px;"><tspan
         x="298.04788"
         y="468.28839"
         id="tspan1442"
         style="text-align:start;text-anchor:start;stroke-width:1.27750325px;">is set, undeploy and </tspan></tspan><tspan
       sodipodi:role="line"
       x="299.58075"
       y="488.51553"
       id="tspan1448"
       style="text-align:start;text-anchor:start;stroke-width:1.27750325px;"><tspan
         x="299.58075"
         y="488.51553"
         id="tspan1446"
         style="text-align:start;text-anchor:start;stroke-width:1.27750325px;">blacklist the update</tspan></tspan></text>
  <rect
     style="color:#000000;clip-rule:nonzero;display:inline;overflow:visible;visibility:visible;opacity:1;isolation:auto;mix-blend-mode:normal;color-interpolation:sRGB;color-interpolation-filters:linearRGB;solid-color:#000000;solid-opacity:1;vector-effect:none;fill:#e3e3e3;fill-opacity:1;fill-rule:nonzero;stroke:#2c2c2c;stroke-width:2.55500627;stroke-linecap:butt;stroke-linejoin:miter;stroke-miterlimit:4;stroke-dasharray:none;stroke-dashoffset:0;stroke-opacity:1;marker:none;marker-start:none;marker-mid:none;marker-end:none;color-rendering:auto;image-rendering:auto;shape-rendering:auto;text-rendering:auto;enable-background:accumulate"
     id="rect817-2-9"
     width="182.40143"
     height="53.005409"
     x="830.37805"
     y="686.08752"
     ry="11.432571" />
  <text
     xml:space="preserve"
     style="font-style:normal;font-variant:normal;font-weight:normal;font-stretch:normal;font-size:16.18170738px;line-height:125%;font-family:'DejaVu Sans';-inkscape-font-specification:'DejaVu Sans';text-align:start;letter-spacing:0px;word-spacing:0px;text-anchor:start;fill:#000000;fill-opacity:1;stroke:none;stroke-width:1.27750325px;stroke-linecap:butt;stroke-linejoin:miter;stroke-opacity:1;"
     x="764.19818"
     y="706.7157"
     id="text1372"><tspan
       sodipodi:role="line"
       x="846.41833"
       y="706.7157"
       id="tspan1366"
       style="text-align:start;text-anchor:start;stroke-width:1.27750325px;"><tspan
         x="843.84253"
         y="706.7157"
         id="tspan1364"
         style="text-align:start;text-anchor:start;stroke-width:1.27750325px;">Deploy update, set </tspan></tspan><tspan
       sodipodi:role="line"
       x="851.69635"
       y="726.94281"
       id="tspan1370"
       style="text-align:start;text-anchor:start;stroke-width:1.27750325px;"><tspan
         x="851.69635"
         y="726.94281"
         id="tspan1368"
         style="text-align:start;text-anchor:start;stroke-width:1.27750325px;">update_available</tspan></tspan></text>
  <rect
     style="color:#000000;clip-rule:nonzero;display:inline;overflow:visible;visibility:visible;opacity:1;isolation:auto;mix-blend-mode:normal;color-interpolation:sRGB;color-interpolation-filters:linearRGB;solid-color:#000000;solid-opacity:1;vector-effect:none;fill:#e3e3e3;fill-opacity:1;fill-rule:nonzero;stroke:#2c2c2c;stroke-width:2.55500627;stroke-linecap:butt;stroke-linejoin:miter;stroke-miterlimit:4;stroke-dasharray:none;stroke-dashoffset:0;stroke-opacity:1;marker:none;marker-start:none;marker-mid:none;marker-end:none;color-rendering:auto;image-rendering:auto;shape-rendering:auto;text-rendering:auto;enable-background:accumulate"
     id="rect817-2-9-1"
     width="182.40143"
     height="53.005409"
     x="830.37805"
     y="557.66382"
     ry="11.432571" />
  <text
     xml:space="preserve"
     style="font-style:normal;font-variant:normal;font-weight:normal;font-stretch:normal;font-size:16.18170738px;line-height:125%;font-family:'DejaVu Sans';-inkscape-font-specification:'DejaVu Sans';text-align:start;letter-spacing:0px;word-spacing:0px;text-anchor:start;fill:#000000;fill-opacity:1;stroke:none;stroke-width:1.27750325px;stroke-linecap:butt;stroke-linejoin:miter;stroke-opacity:1;"
     x="783.81299"
     y="580.08557"
     id="text1362"><tspan
       sodipodi:role="line"
       x="853.67957"
       y="580.08557"
       id="tspan1356"
       style="text-align:start;text-anchor:start;stroke-width:1.27750325px;"><tspan
         x="853.67957"
         y="580.08557"
         id="tspan1354"
         style="text-align:start;text-anchor:start;stroke-width:1.27750325px;">Request reboot /</tspan></tspan><tspan
       sodipodi:role="line"
       x="861.16992"
       y="600.31268"
       id="tspan1360"
       style="text-align:start;text-anchor:start;stroke-width:1.27750325px;"><tspan
         x="861.16992"
         y="600.31268"
         id="tspan1358"
         style="text-align:start;text-anchor:start;stroke-width:1.27750325px;">wait for reboot</tspan></tspan></text>
  <text
     xml:space="preserve"
     style="font-style:normal;font-variant:normal;font-weight:normal;font-stretch:normal;font-size:16.18170738px;line-height:125%;font-family:'DejaVu Sans';-inkscape-font-specification:'DejaVu Sans';text-align:center;letter-spacing:0px;word-spacing:0px;text-anchor:middle;fill:#000000;fill-opacity:1;stroke:none;stroke-width:1.27750313px;stroke-linecap:butt;stroke-linejoin:miter;stroke-opacity:1"
     x="140.6515"
     y="284.38031"
     id="text1389"><tspan
       sodipodi:role="line"
       x="140.6515"
       y="284.38031"
       id="tspan1387"
       style="stroke-width:1.27750313px">no<tspan
   x="140.6515"
   y="284.38031"
   id="tspan1381"
   style="stroke-width:1.27750313px" /></tspan></text>
  <text
     xml:space="preserve"
     style="font-style:normal;font-variant:normal;font-weight:normal;font-stretch:normal;font-size:16.18170738px;line-height:125%;font-family:'DejaVu Sans';-inkscape-font-specification:'DejaVu Sans';text-align:center;letter-spacing:0px;word-spacing:0px;text-anchor:middle;fill:#000000;fill-opacity:1;stroke:none;stroke-width:1.27750313px;stroke-linecap:butt;stroke-linejoin:miter;stroke-opacity:1"
     x="38.264599"
     y="449.65976"
     id="text1389-1"><tspan
       sodipodi:role="line"
       x="38.264599"
       y="449.65976"
       id="tspan1387-5"
       style="stroke-width:1.27750313px">no<tspan
   x="38.264599"
   y="449.65976"
   id="tspan1381-9"
   style="stroke-width:1.27750313px" /></tspan></text>
  <text
     xml:space="preserve"
     style="font-style:normal;font-variant:normal;font-weight:normal;font-stretch:normal;font-size:16.18170738px;line-height:125%;font-family:'DejaVu Sans';-inkscape-font-specification:'DejaVu Sans';text-align:center;letter-spacing:0px;word-spacing:0px;text-anchor:middle;fill:#000000;fill-opacity:1;stroke:none;stroke-width:1.27750313px;stroke-linecap:butt;stroke-linejoin:miter;stroke-opacity:1"
     x="671.09167"
     y="645.84082"
     id="text1389-4"><tspan
       sodipodi:role="line"
       x="671.09167"
       y="645.84082"
       id="tspan1387-9"
       style="stroke-width:1.27750313px">no<tspan
   x="671.09167"
   y="645.84082"
   id="tspan1381-0"
   style="stroke-width:1.27750313px" /></tspan></text>
  <text
     xml:space="preserve"
     style="font-style:normal;font-variant:normal;font-weight:normal;font-stretch:normal;font-size:16.18170738px;line-height:125%;font-family:'DejaVu Sans';-inkscape-font-specification:'DejaVu Sans';text-align:center;letter-spacing:0px;word-spacing:0px;text-anchor:middle;fill:#000000;fill-opacity:1;stroke:none;stroke-width:1.27750313px;stroke-linecap:butt;stroke-linejoin:miter;stroke-opacity:1"
     x="63.943619"
     y="34.399277"
     id="text1389-9"><tspan
       sodipodi:role="line"
       x="63.943619"
       y="34.399277"
       id="tspan1387-1"
       style="stroke-width:1.27750313px">Start</tspan></text>
  <text
     xml:space="preserve"
     style="font-style:normal;font-variant:normal;font-weight:normal;font-stretch:normal;font-size:16.18170738px;line-height:125%;font-family:'DejaVu Sans';-inkscape-font-specification:'DejaVu Sans';text-align:center;letter-spacing:0px;word-spacing:0px;text-anchor:middle;fill:#000000;fill-opacity:1;stroke:none;stroke-width:1.27750313px;stroke-linecap:butt;stroke-linejoin:miter;stroke-opacity:1"
     x="148.98172"
     y="514.19922"
     id="text1389-9-7"><tspan
       sodipodi:role="line"
       x="148.98172"
       y="514.19922"
       id="tspan1387-1-1"
       style="stroke-width:1.27750313px">yes</tspan></text>
  <text
     xml:space="preserve"
     style="font-style:normal;font-variant:normal;font-weight:normal;font-stretch:normal;font-size:16.18170738px;line-height:125%;font-family:'DejaVu Sans';-inkscape-font-specification:'DejaVu Sans';text-align:center;letter-spacing:0px;word-spacing:0px;text-anchor:middle;fill:#000000;fill-opacity:1;stroke:none;stroke-width:1.27750313px;stroke-linecap:butt;stroke-linejoin:miter;stroke-opacity:1"
     x="301.04037"
     y="199.6899"
     id="text1389-9-1"><tspan
       sodipodi:role="line"
       x="301.04037"
       y="199.6899"
       id="tspan1387-1-5"
       style="stroke-width:1.27750313px">yes</tspan></text>
  <text
     xml:space="preserve"
     style="font-style:normal;font-variant:normal;font-weight:normal;font-stretch:normal;font-size:16.18170738px;line-height:125%;font-family:'DejaVu Sans';-inkscape-font-specification:'DejaVu Sans';text-align:center;letter-spacing:0px;word-spacing:0px;text-anchor:middle;fill:#000000;fill-opacity:1;stroke:none;stroke-width:1.27750313px;stroke-linecap:butt;stroke-linejoin:miter;stroke-opacity:1"
     x="777.32635"
     y="705.14972"
     id="text1389-9-9"><tspan
       sodipodi:role="line"
       x="777.32635"
       y="705.14972"
       id="tspan1387-1-7"
       style="stroke-width:1.27750313px">yes</tspan></text>
  <text
     xml:space="preserve"
     style="font-style:normal;font-variant:normal;font-weight:normal;font-stretch:normal;font-size:16.18170738px;line-height:125%;font-family:'DejaVu Sans';-inkscape-font-specification:'DejaVu Sans';text-align:center;letter-spacing:0px;word-spacing:0px;text-anchor:middle;fill:#000000;fill-opacity:1;stroke:none;stroke-width:1.27750313px;stroke-linecap:butt;stroke-linejoin:miter;stroke-opacity:1"
     x="441.88837"
     y="618.55682"
     id="text1389-9-76"><tspan
       sodipodi:role="line"
       x="441.88837"
       y="618.55682"
       id="tspan1387-1-73"
       style="stroke-width:1.27750313px">found update</tspan></text>
  <path
     style="fill:none;fill-rule:evenodd;stroke:#000000;stroke-width:1.27750313px;stroke-linecap:butt;stroke-linejoin:miter;stroke-opacity:1;marker-end:url(#marker10351)"
     d="m 126.33972,254.05105 v 50.9269"
     id="path1482"
     inkscape:connector-curvature="0" />
  <path
     style="fill:none;fill-rule:evenodd;stroke:#000000;stroke-width:1.27750313px;stroke-linecap:butt;stroke-linejoin:miter;stroke-opacity:1"
     d="m 170.85751,112.70292 v 50.40722"
     id="path1486"
     inkscape:connector-curvature="0" />
  <path
     style="fill:none;fill-rule:evenodd;stroke:#000000;stroke-width:1.27750313px;stroke-linecap:butt;stroke-linejoin:miter;stroke-opacity:1;marker-end:url(#marker10053)"
     d="m 126.33972,376.17168 v 50.40726"
     id="path1488"
     inkscape:connector-curvature="0" />
  <path
     style="fill:none;fill-rule:evenodd;stroke:#000000;stroke-width:1.27750313px;stroke-linecap:butt;stroke-linejoin:miter;stroke-opacity:1;marker-end:url(#marker9475)"
     d="m 380.71445,377.66908 v 50.29845"
     id="path1490"
     inkscape:connector-curvature="0"
     sodipodi:nodetypes="cc" />
  <path
     style="fill:none;fill-rule:evenodd;stroke:#000000;stroke-width:1.27750313px;stroke-linecap:butt;stroke-linejoin:miter;stroke-opacity:1;marker-end:url(#marker9761)"
     d="m 126.33972,488.9384 v 50.40725"
     id="path1492"
     inkscape:connector-curvature="0" />
  <path
     style="fill:none;fill-rule:evenodd;stroke:#000000;stroke-width:1.27750313px;stroke-linecap:butt;stroke-linejoin:miter;stroke-opacity:1;marker-end:url(#marker9195)"
     d="m 208.41394,574.88396 h 88.63483"
     id="path1496"
     inkscape:connector-curvature="0"
     sodipodi:nodetypes="cc" />
  <path
     style="fill:none;fill-rule:evenodd;stroke:#000000;stroke-width:1.27750313px;stroke-linecap:butt;stroke-linejoin:miter;stroke-opacity:1;marker-end:url(#marker8921)"
     d="m 380.71443,593.59183 v 71.18944"
     id="path1502"
     inkscape:connector-curvature="0" />
  <path
     style="fill:none;fill-rule:evenodd;stroke:#000000;stroke-width:1.27750313px;stroke-linecap:butt;stroke-linejoin:miter;stroke-opacity:1;marker-end:url(#marker8135)"
     d="m 483.34776,709.7949 h 76.99663"
     id="path1504"
     inkscape:connector-curvature="0" />
  <path
     style="fill:#e3e3e3;fill-rule:evenodd;stroke:#000000;stroke-width:1.27750313px;stroke-linecap:butt;stroke-linejoin:miter;stroke-opacity:1;marker-end:url(#marker8391);fill-opacity:1"
     d="M 558.5256,574.88397 H 464.38008"
     id="path1506"
     inkscape:connector-curvature="0" />
  <path
     style="fill:none;fill-rule:evenodd;stroke:#000000;stroke-width:1.27750313px;stroke-linecap:butt;stroke-linejoin:miter;stroke-opacity:1;marker-end:url(#marker8653)"
     d="M 651.54513,686.08752 V 600.60724"
     id="path1508"
     inkscape:connector-curvature="0" />
  <path
     style="fill:none;fill-rule:evenodd;stroke:#000000;stroke-width:1.27750313px;stroke-linecap:butt;stroke-linejoin:miter;stroke-opacity:1;marker-end:url(#marker7885)"
     d="m 742.74587,712.59021 h 87.63215"
     id="path1510"
     inkscape:connector-curvature="0" />
  <path
     style="fill:none;fill-rule:evenodd;stroke:#000000;stroke-width:1.27750313px;stroke-linecap:butt;stroke-linejoin:miter;stroke-opacity:1;marker-end:url(#TriangleOutL)"
     d="M 921.57876,686.08752 V 610.66926"
     id="path1512"
     inkscape:connector-curvature="0" />
  <path
     style="fill:none;fill-rule:evenodd;stroke:#000000;stroke-width:1.27750313px;stroke-linecap:butt;stroke-linejoin:miter;stroke-opacity:1;marker-end:url(#marker10655)"
     d="m 275.00645,208.58058 h 100.83677 v 97.3751"
     id="path1516"
     inkscape:connector-curvature="0"
     sodipodi:nodetypes="ccc" />
  <path
     style="fill:none;fill-rule:evenodd;stroke:#000000;stroke-width:1.27750313px;stroke-linecap:butt;stroke-linejoin:miter;stroke-opacity:1;marker-end:url(#marker10965)"
     d="M 921.40635,557.66383 V 81.523187 H 228.02037"
     id="path1516-6"
     inkscape:connector-curvature="0"
     sodipodi:nodetypes="ccc" />
  <path
     style="fill:none;fill-rule:evenodd;stroke:#000000;stroke-width:1.27750313px;stroke-linecap:butt;stroke-linejoin:miter;stroke-opacity:1;marker-end:url(#marker9475-5)"
     d="M 380.71445,499.68092 208.41394,539.34564"
     id="path1490-3"
     inkscape:connector-curvature="0"
     sodipodi:nodetypes="cc" />
  <path
     id="path1496-8"
     style="fill:none;fill-rule:evenodd;stroke:#000000;stroke-width:1.27750313px;stroke-linecap:butt;stroke-linejoin:miter;stroke-opacity:1;marker-end:url(#marker9195-9)"
     d="M 54.886137,457.75868 H 11.753913 L 12.273575,81.523187 H 113.69463"
     inkscape:connector-curvature="0"
     sodipodi:nodetypes="cccc" />
  <path
     style="fill:none;fill-rule:evenodd;stroke:#000000;stroke-width:1.27750313px;stroke-linecap:butt;stroke-linejoin:miter;stroke-opacity:1;marker-end:url(#marker9195-1)"
     d="M 89.887694,29.426886 H 170.85751 V 50.343448"
     id="path1496-9"
     inkscape:connector-curvature="0"
     sodipodi:nodetypes="ccc" />
</svg>
